1-n-butyladamantane

Kovats' RI, non-polar column, isothermal

Data compiled by: NIST Mass Spectrometry Data Center, William E. Wallace, director

Column type CapillaryCapillaryCapillaryCapillaryPacked
Active phase SE-30SE-30SE-30SE-30SE-30
Column length (m)     6.1
Carrier gas     N2
Substrate     Chrom W
Column diameter (mm)
Phase thickness (μm)
Temperature (C) 130.140.145.150.120.
I 1424.1431.1443.1443.1431.
ReferenceBogoslovsky, Anvaer, et al., 1978Bogoslovsky, Anvaer, et al., 1978Bogoslovsky, Anvaer, et al., 1978Bogoslovsky, Anvaer, et al., 1978Mitra, Mohan, et al., 1974
Comment MSDC-RI MSDC-RI MSDC-RI MSDC-RI MSDC-RI
Column type PackedPackedCapillaryCapillaryCapillary
Active phase SE-30SE-30SE-30SE-30SE-30
Column length (m) 6.16.150.50.50.
Carrier gas N2N2N2N2N2
Substrate Chrom WChrom W
Column diameter (mm)   0.270.270.27
Phase thickness (μm)
Temperature (C) 130.140.145.160.175.
I 1443.1451.1443.1457.1469.
ReferenceMitra, Mohan, et al., 1974Mitra, Mohan, et al., 1974Burkhard, Vais, et al., 1969Burkhard, Vais, et al., 1969Burkhard, Vais, et al., 1969
Comment MSDC-RI MSDC-RI MSDC-RI MSDC-RI MSDC-RI
Column type Capillary
Active phase SE-30
Column length (m) 50.
Carrier gas N2
Substrate
Column diameter (mm) 0.27
Phase thickness (μm)
Temperature (C) 190.
I 1479.
ReferenceBurkhard, Vais, et al., 1969
Comment MSDC-RI

References

Bogoslovsky, Anvaer, et al., 1978
Bogoslovsky, Yu.N.; Anvaer, B.I.; Vigdergauz, M.S., Chromatographic constants in gas chromatography (in Russian), Standards Publ. House, Moscow, 1978, 192. [all data]

Mitra, Mohan, et al., 1974
Mitra, G.D.; Mohan, G.; Sinha, A., Advances in the utilization of the retention index system for characterizing hydrocarbons in complex mixtures by gas chromatography, J. Chromatogr., 1974, 99, 215-230, https://doi.org/10.1016/S0021-9673(00)90857-4 . [all data]

Burkhard, Vais, et al., 1969
Burkhard, J.; Vais, J.; Vodicka, L.; Landa, S., Adamantane and its derivatives. XVI. The gas chromatographic characterization of adamantane derivatives, J. Chromatogr., 1969, 42, 207-218, https://doi.org/10.1016/S0021-9673(01)80617-8 . [all data]