HBCBH

Vibrational and/or electronic energy levels

Data compiled by: Marilyn E. Jacox

State:   X

Vib.
sym.
 No.   Approximate
 type of mode
 cm-1   Med.   Method   References

Σu+ 4 BCB a-stretch 1872.0 Ar IR Hassanzadeh and Andrews, 1992
Hassanzadeh, Hannachi, et al., 1993

Additional references: Jacox, 1994, page 245; Jacox, 1998, page 275

References

Hassanzadeh and Andrews, 1992
Hassanzadeh, P.; Andrews, L., Reactions of pulsed laser evaporated boron atoms with methane. 1. Synthesis and characterization of a novel molecule with carbon-boron double bonds: HBCBH, J. Am. Chem. Soc., 1992, 114, 23, 9239, https://doi.org/10.1021/ja00049a096 . [all data]

Hassanzadeh, Hannachi, et al., 1993
Hassanzadeh, P.; Hannachi, Y.; Andrews, L., Pulsed laser evaporated boron atom reactions with methane. 2. Infrared spectra of H2CBH2, H2CBH, HCBH, and HBCBH in solid argon, J. Phys. Chem., 1993, 97, 24, 6418, https://doi.org/10.1021/j100126a016 . [all data]

Jacox, 1994
Jacox, M.E., Vibrational and electronic energy levels of polyatomic transient molecules, American Chemical Society, Washington, DC, 1994, 464. [all data]

Jacox, 1998
Jacox, M.E., Vibrational and electronic energy levels of polyatomic transient molecules: supplement A, J. Phys. Chem. Ref. Data, 1998, 27, 2, 115-393, https://doi.org/10.1063/1.556017 . [all data]