1,6-Octadien-3-ol, 3,7-dimethyl-, propanoate

Kovats' RI, non-polar column, temperature ramp

Data compiled by: NIST Mass Spectrometry Data Center, William E. Wallace, director

Column type CapillaryCapillaryCapillaryCapillaryCapillary
Active phase BP-1BP-1BP-1BP-1BP-1
Column length (m) 25.60.25.30.25.
Carrier gas N2N2N2N2N2
Substrate
Column diameter (mm) 0.320.320.550.320.55
Phase thickness (μm) 0.250.250.250.250.25
Tstart (C) 60.60.60.60.60.
Tend (C) 220.220.220.220.220.
Heat rate (K/min) 5.5.5.5.5.
Initial hold (min)
Final hold (min) 15. 15.13.15.
I 1312.1324.1314.1313.1323.
ReferenceRaina, Srivastava, et al., 2003Raina, Lal, et al., 2002Raina, Srivastava, et al., 2002Shawl, Srivastava, et al., 2002Jain, Aggarwal, et al., 2001
Comment MSDC-RI MSDC-RI MSDC-RI MSDC-RI MSDC-RI
Column type Capillary
Active phase BP-1
Column length (m) 25.
Carrier gas N2
Substrate
Column diameter (mm) 0.55
Phase thickness (μm) 0.25
Tstart (C) 60.
Tend (C) 220.
Heat rate (K/min) 5.
Initial hold (min)
Final hold (min) 15.
I 1320.
ReferenceJain, Srivastava, et al., 2001
Comment MSDC-RI

Van Den Dool and Kratz RI, non-polar column, temperature ramp

Data compiled by: NIST Mass Spectrometry Data Center, William E. Wallace, director

Column type CapillaryCapillaryCapillaryCapillary
Active phase SPB-1BP-1Mega 5MSMega 5MS
Column length (m) 30.30.30.30.
Carrier gas HeN2HeHe
Substrate
Column diameter (mm) 0.250.320.250.25
Phase thickness (μm) 0.250.250.250.25
Tstart (C) 50.60.40.40.
Tend (C) 250.220.240.240.
Heat rate (K/min) 5.5.3.3.
Initial hold (min) 3. 2.2.
Final hold (min) 15.13.
I 1346.1319.1333.1333.
ReferenceBlagojevic, Radulovic, et al., 2006Raina, Kumar, et al., 2004Verzera, Trozzi, et al., 2003Verzera, la Rosa, et al., 2000
Comment MSDC-RI MSDC-RI MSDC-RI MSDC-RI

References

Raina, Srivastava, et al., 2003
Raina, V.K.; Srivastava, S.K.; Syamasunder, K.V., Essential oil composition of Acorus calamus L. from the lower region of the Himalayas, Flavour Fragr. J., 2003, 18, 1, 18-20, https://doi.org/10.1002/ffj.1136 . [all data]

Raina, Lal, et al., 2002
Raina, V.K.; Lal, R.K.; Tripathi, S.; Khan, M.; Syamasundar, K.V.; Srivastava, S.K., Erratum. Essential oil composition of genetically diverse stocks of Murraya koenigii from India, Flavour Fragr. J., 2002, 17, 5, 404, https://doi.org/10.1002/ffj.1139 . [all data]

Raina, Srivastava, et al., 2002
Raina, V.K.; Srivastava, S.K.; Jain, N.; Ahmad, A.; Syamasundar, K.V.; Aggarwal, K.K., Essential oil composition of Curcuma longa L. cv. Roma from the plains of northern India, Flavour Fragr. J., 2002, 17, 2, 99-102, https://doi.org/10.1002/ffj.1053 . [all data]

Shawl, Srivastava, et al., 2002
Shawl, A.S.; Srivastava, S.K.; Syamasundar, K.V.; Tripathi, S.; Raina, V.K., Essential oil composition of Achillea millefolium L. growing wild in Kashmir, India, Flavour Fragr. J., 2002, 17, 3, 165-168, https://doi.org/10.1002/ffj.1074 . [all data]

Jain, Aggarwal, et al., 2001
Jain, N.; Aggarwal, K.K.; Syamasundar, K.V.; Srivastava, S.K.; Kumar, S., Essential oil composition of geranium (Pelargonium sp.) from the plains of Northern India, Flavour Fragr. J., 2001, 16, 1, 44-46, https://doi.org/10.1002/1099-1026(200101/02)16:1<44::AID-FFJ943>3.0.CO;2-X . [all data]

Jain, Srivastava, et al., 2001
Jain, N.; Srivastava, S.K.; Aggarwal, K.K.; Ramesh, S.; Kumar, S., Essential oil composition of Zanthoxylum alatum seeds from northern India, Flavour Fragr. J., 2001, 16, 6, 408-410, https://doi.org/10.1002/ffj.1024 . [all data]