Benzene, 1-(1,1-dimethylethyl)-3-ethyl-

Kovats' RI, non-polar column, custom temperature program

Data compiled by: NIST Mass Spectrometry Data Center, William E. Wallace, director

Column type Capillary
Active phase Squalane
Column length (m) 100.
Carrier gas N2
Substrate
Column diameter (mm) 0.25
Phase thickness (μm)
Program not specified
I 1142.
ReferencePapazova and Pankova, 1975
Comment MSDC-RI

References

Papazova and Pankova, 1975
Papazova, D.I.; Pankova, M.C., Identification of individual aromatic hydrocarbons in kerosene fraction (b.p. 150-250 °), J. Chromatogr., 1975, 105, 2, 411-414, https://doi.org/10.1016/S0021-9673(01)82276-7 . [all data]