bis(4-amino-3-penten-2-onato)copper

Phase change data

Data compiled by: William E. Acree, Jr., James S. Chickos

Enthalpy of sublimation

ΔsubH (kJ/mol) Temperature (K) Reference
114.2 ± 1.3393. - 463.Stabnikov, Baidina, et al., 2003

References

Stabnikov, Baidina, et al., 2003
Stabnikov, P.A.; Baidina, I.A.; Sysoev, S.V.; Vanina, N.S.; Morozova, N.B.; Igumenov, I.K., Saturated Vapor Pressure and Crystal Structure of Bis-(2-imino-4-pentanonato)copper(II), Journal of Structural Chemistry, 2003, 44, 6, 1054-1061, https://doi.org/10.1023/B:JORY.0000034813.62351.60 . [all data]