2,5-dimethyl-3(2H)-furanone

Van Den Dool and Kratz RI, polar column, temperature ramp

Data compiled by: NIST Mass Spectrometry Data Center, William E. Wallace, director

Column type CapillaryCapillary
Active phase DB-WaxCP-WAX 57CB
Column length (m) 30.50.
Carrier gas HeHe
Substrate
Column diameter (mm) 0.250.24
Phase thickness (μm) 0.25
Tstart (C) 50.50.
Tend (C) 220.210.
Heat rate (K/min) 4.2.
Initial hold (min) 4.5.
Final hold (min) 20.
I 1483.1485.
ReferenceOsorio, Alarcon, et al., 2006Baltes and Mevissen, 1988
Comment MSDC-RI MSDC-RI

Gas phase ion energetics data

Data compiled by: Sharon G. Lias, Rhoda D. Levin, and Sherif A. Kafafi

Ionization energy determinations

IE (eV) Method Reference
9.23 ± 0.05EIThorstad, Undheim, et al., 1975

Van Den Dool and Kratz RI, non-polar column, temperature ramp

View large format table.

Column type Active phase I Reference Comment
CapillaryDB-1918.Osorio, Alarcon, et al., 200625. m/0.2 mm/0.33 μm, 4. K/min; Tstart: 50. C; Tend: 300. C

Van Den Dool and Kratz RI, polar column, custom temperature program

View large format table.

Column type Active phase I Reference Comment
CapillaryCarbowax1492.Baltes w. and Bochmann G., 1987Column diameter: 0.3 mm; Program: not specified
CapillaryCarbowax1493.Baltes w. and Bochmann G., 1987Column diameter: 0.3 mm; Program: not specified
CapillaryCarbowax1493.Baltes w. and Bochmann G., 1987Column diameter: 0.3 mm; Program: not specified
CapillaryCarbowax1494.Baltes w. and Bochmann G., 1987Column diameter: 0.3 mm; Program: not specified

Normal alkane RI, non-polar column, temperature ramp

View large format table.

Column type Active phase I Reference Comment
CapillaryDB-1924.Chen and Ho, 199960. m/0.32 mm/1. μm, He, 2. K/min; Tstart: 40. C; Tend: 260. C
CapillaryDB-1917.Tai and Ho, 199860. m/0.32 mm/1.0 μm, He, 2. K/min; Tstart: 40. C; Tend: 280. C

Normal alkane RI, non-polar column, custom temperature program

View large format table.

Column type Active phase I Reference Comment
CapillaryHP-1913.Teai, Claude-Lafontaine, et al., 200150. m/0.32 mm/0.52 μm, N2; Program: 40C => 2C/min => 130C => 4C/min => 250C

Normal alkane RI, polar column, temperature ramp

View large format table.

Column type Active phase I Reference Comment
CapillaryTC-Wax1518.Ishikawa, Ito, et al., 200460. m/0.25 mm/0.5 μm, He, 40. C @ 8. min, 3. K/min; Tend: 230. C
CapillaryDB-Wax1535.López, Ezpeleta, et al., 200460. m/0.25 mm/0.25 μm, He, 40. C @ 5. min, 3. K/min; Tend: 220. C

Normal alkane RI, polar column, custom temperature program

View large format table.

Column type Active phase I Reference Comment
CapillaryCarbowax 20M1540.Teai, Claude-Lafontaine, et al., 200150. m/0.2 mm/0.2 μm, N2; Program: 60C => 2C/min => 150C => 4C/min => 220C

References

Osorio, Alarcon, et al., 2006
Osorio, C.; Alarcon, M.; Moreno, C.; Bonilla, A.; Barrios, J.; Garzon, C.; Duque, C., Characterization of Odor-Active Volatiles in Champa ( Campomanesia lineatifolia R. P.), J. Agric. Food Chem., 2006, 54, 2, 509-516, https://doi.org/10.1021/jf052098c . [all data]

Baltes and Mevissen, 1988
Baltes, W.; Mevissen, L., Model reactions on roast aroma formation. VI. Volatile reaction products from the reaction of phenylalanine with glucose during cooking and roasting, Z. Lebensm. Unters. Forsch., 1988, 187, 3, 209-214, https://doi.org/10.1007/BF01043341 . [all data]