trans-1,2-Diphenylethylene oxide

Gas phase ion energetics data

Data compiled by: Sharon G. Lias, Rhoda D. Levin, and Sherif A. Kafafi

Ionization energy determinations

IE (eV) Method Reference
8.60PEArnold and Wong, 1979

References

Arnold and Wong, 1979
Arnold, D.R.; Wong, P.C., The oxidation potentials of cis- and trans-1,2-diphenylcyclo- propane and cis- and trans-2,3-diphenyloxirane, Can. J. Chem., 1979, 57, 2098. [all data]