Dimethyltetraphenylcyclotrisiloxane

Phase change data

Data compiled as indicated in comments:
TRC - Thermodynamics Research Center, NIST Boulder Laboratories, Chris Muzny director
AC - William E. Acree, Jr., James S. Chickos
DH - Eugene S. Domalski and Elizabeth D. Hearing

Quantity Value Units Method Reference Comment
Ttriple361.06KN/AKuliev, Dzhafarov, et al., 1982Crystal phase 1 phase; Uncertainty assigned by TRC = 0.02 K; TRC

Enthalpy of fusion

ΔfusH (kJ/mol) Temperature (K) Reference Comment
28.2361.1Domalski and Hearing, 1996AC

Enthalpy of phase transition

ΔHtrs (kJ/mol) Temperature (K) Initial Phase Final Phase Reference Comment
28.200361.06crystaline, IliquidKuliev, Dzhafarov, et al., 1982, 2DH

Entropy of phase transition

ΔStrs (J/mol*K) Temperature (K) Initial Phase Final Phase Reference Comment
78.2361.06crystaline, IliquidKuliev, Dzhafarov, et al., 1982, 2DH

In addition to the Thermodynamics Research Center (TRC) data available from this site, much more physical and chemical property data is available from the following TRC products:

References

Kuliev, Dzhafarov, et al., 1982
Kuliev, A.M.; Dzhafarov, O.I.; Karasharli, K.A.; Kostryukov, V.N., Heat capacity and thermodynamic functions of cyclic methylphenylsiloxanes, Zh. Fiz. Khim., 1982, 56, 310-13. [all data]

Domalski and Hearing, 1996
Domalski, Eugene S.; Hearing, Elizabeth D., Heat Capacities and Entropies of Organic Compounds in the Condensed Phase. Volume III, J. Phys. Chem. Ref. Data, 1996, 25, 1, 1, https://doi.org/10.1063/1.555985 . [all data]

Kuliev, Dzhafarov, et al., 1982, 2
Kuliev, A.M.; Dzhafarov, O.I.; Karasharli, K.A.; Kostryukov, V.N., Heat capacity and thermodynamic functions of cyclic methylphenylsiloxanes, Zhur. Fiz. Khim., 1982, 56, 310-313. [all data]