Oxirane, (1-methylethyl)-

Kovats' RI, non-polar column, isothermal

View large format table.

Column type Active phase Temperature (C) I Reference Comment
CapillaryOV-10170.612.Tarjan, Nyiredy, et al., 1989
CapillaryOV-10180.613.Tarjan, Nyiredy, et al., 1989
CapillaryOV-10190.614.Tarjan, Nyiredy, et al., 1989
CapillaryOV-10170.612.0Boneva and Dimov, 1987100. m/0.27 mm/0.9 μm
CapillaryOV-10180.613.3Boneva and Dimov, 1987100. m/0.27 mm/0.9 μm
CapillaryOV-10190.613.8Boneva and Dimov, 1987100. m/0.27 mm/0.9 μm

Normal alkane RI, non-polar column, custom temperature program

View large format table.

Column type Active phase I Reference Comment
CapillaryMethyl Silicone627.Farkas, Héberger, et al., 2004Program: not specified

Phase change data

Data compiled by: Thermodynamics Research Center, NIST Boulder Laboratories, Chris Muzny director

Quantity Value Units Method Reference Comment
Tboil354.15KN/AMalinovskii and Konevichev, 1948Uncertainty assigned by TRC = 3. K

In addition to the Thermodynamics Research Center (TRC) data available from this site, much more physical and chemical property data is available from the following TRC products:

References

Tarjan, Nyiredy, et al., 1989
Tarjan, G.; Nyiredy, Sz.; Gyor, M.; Lombosi, E.R.; Lombosi, T.S.; Budahegyi, M.V.; Meszaros, S.Y.; Takacs, J.M., Review. Thirtieth Anniversary of the Retention Index According to Kovats in Gas-Liquid Chromatography, J. Chromatogr., 1989, 472, 1-92, https://doi.org/10.1016/S0021-9673(00)94099-8 . [all data]

Boneva and Dimov, 1987
Boneva, S.; Dimov, N., Gas chromatographic separation of C4-C5 epoxides on a glass capillary column coated with OV-101 methylsilicone, Chromatographia, 1987, 23, 10, 770-772, https://doi.org/10.1007/BF02312672 . [all data]

Farkas, Héberger, et al., 2004
Farkas, O.; Héberger, K.; Zenkevich, I.G., Quantitative structure-retention relationships. XIV. Prediction of gas chromatographic retention indices for saturated O-, N-, and S-heterocyclic compounds, Chemom. Intell. Lab. Syst., 2004, 72, 2, 173-184, https://doi.org/10.1016/j.chemolab.2004.01.012 . [all data]