CAS Reg. No. 14380-62-2

Reaction thermochemistry data

Data compiled by: John E. Bartmess

Individual Reactions

(CAS Reg. No. 14380-62-2 • 4294967295Oxygen, atomic) + Oxygen, atomic = CAS Reg. No. 14380-62-2

By formula: (CAS Reg. No. 14380-62-2 • 4294967295O) + O = CAS Reg. No. 14380-62-2

Quantity Value Units Method Reference Comment
Δr136.1kJ/molN/AGilles, Polak, et al., 1992gas phase

References

Gilles, Polak, et al., 1992
Gilles, M.K.; Polak, M.L.; Lineberger, W.C., Photoelectron Spectroscopy of the Halogen Oxide Anions FO-, ClO-, BrO-, IO-, OClO-, and OIO-, J. Chem. Phys., 1992, 96, 11, 8012, https://doi.org/10.1063/1.462352 . [all data]