CAS Reg. No. 14380-61-1

Reaction thermochemistry data

Data compiled by: John E. Bartmess

Individual Reactions

(CAS Reg. No. 14380-61-1 • 4294967295Oxygen, atomic) + Oxygen, atomic = CAS Reg. No. 14380-61-1

By formula: (CAS Reg. No. 14380-61-1 • 4294967295O) + O = CAS Reg. No. 14380-61-1

Quantity Value Units Method Reference Comment
Δr140.0kJ/molN/ADistelrath and Boesl, 2000gas phase

References

Distelrath and Boesl, 2000
Distelrath, V.; Boesl, U., Mass selective gas phase study of ClO, OClO, ClOO and ClAr by anion-ZEKE-photoelectron spectroscopy, Faraday Disc. Chem. Soc., 2000, 115, 161-174, https://doi.org/10.1039/a909618c . [all data]