2-Hydroxy-5-methyl-4'-nitroazobenzene

Gas phase ion energetics data

Data compiled as indicated in comments:
LLK - Sharon G. Lias, Rhoda D. Levin, and Sherif A. Kafafi

Ionization energy determinations

IE (eV) Method Reference Comment
7.7PEMillefiori and Millefiori, 1981LLK
8.14PEMillefiori and Millefiori, 1981Vertical value; LLK

References

Millefiori and Millefiori, 1981
Millefiori, S.; Millefiori, A., Spectroscopic and electrochemical properties of intramolecularly hydrogen-bonded compounds. Ortho-hydroxyazobenzenes, Can. J. Chem., 1981, 59, 821. [all data]