Bis(diisopropyldithiocarbamate)copper complex

Phase change data

Data compiled by: William E. Acree, Jr., James S. Chickos

Enthalpy of vaporization

ΔvapH (kJ/mol) Temperature (K) Reference Comment
118.4437.Dykyj, Svoboda, et al., 1999Based on data from 422. - 453. K.

Enthalpy of sublimation

ΔsubH (kJ/mol) Temperature (K) Method Reference Comment
129.5 ± 2.9452.5AStephenson and Malanowski, 1987Based on data from 440. - 465. K. See also Tavlaridis and Neeb, 1978.

References

Dykyj, Svoboda, et al., 1999
Dykyj, J.; Svoboda, J.; Wilhoit, R.C.; Frenkel, M.L.; Hall, K.R., Vapor Pressure of Chemicals: Part A. Vapor Pressure and Antoine Constants for Hydrocarbons and Sulfur, Selenium, Tellurium and Hydrogen Containing Organic Compounds, Springer, Berlin, 1999, 373. [all data]

Stephenson and Malanowski, 1987
Stephenson, Richard M.; Malanowski, Stanislaw, Handbook of the Thermodynamics of Organic Compounds, 1987, https://doi.org/10.1007/978-94-009-3173-2 . [all data]

Tavlaridis and Neeb, 1978
Tavlaridis, Athanassios; Neeb, Rolf, Dialkyldithiocarbamates as reagents for the gas-chromatographic determination of metals, Z. Anal. Chem., 1978, 293, 3, 211-219, https://doi.org/10.1007/BF00491050 . [all data]