Dimethylcadmium·dimethyltellurium

Phase change data

Data compiled by: Eugene S. Domalski and Elizabeth D. Hearing

Enthalpy of phase transition

ΔHtrs (kJ/mol) Temperature (K) Initial Phase Final Phase Reference Comment
0.669103.2crystaline, IIcrystaline, ILebedev, Kulagina, et al., 1992
10.775210.45crystaline, IliquidLebedev, Kulagina, et al., 1992

Entropy of phase transition

ΔStrs (J/mol*K) Temperature (K) Initial Phase Final Phase Reference Comment
0.84103.2crystaline, IIcrystaline, ILebedev, Kulagina, et al., 1992
51.40210.45crystaline, IliquidLebedev, Kulagina, et al., 1992

Condensed phase thermochemistry data

Data compiled by: Eugene S. Domalski and Elizabeth D. Hearing

Quantity Value Units Method Reference Comment
liquid413.06J/mol*KN/ALebedev, Kulagina, et al., 1992

Constant pressure heat capacity of liquid

Cp,liquid (J/mol*K) Temperature (K) Reference Comment
275.21298.15Lebedev, Kulagina, et al., 1992T = 12 to 310 K.

References

Lebedev, Kulagina, et al., 1992
Lebedev, B.V.; Kulagina, T.G.; Sheiman, M.S.; Nistratov, V.P., Thermodynamics of the complexes (CH3)2CdxSe(CH3)2 and (CH3)2CdxTe(CH3)2 in the temperature range from 0 to 310 K, J. Chem. Thermodynam., 1992, 24, 673-683. [all data]