Dimethylcadmium·dimethylselenium

Phase change data

Data compiled by: Eugene S. Domalski and Elizabeth D. Hearing

Enthalpy of fusion

ΔfusH (kJ/mol) Temperature (K) Reference Comment
12.679205.64Lebedev, Kulagina, et al., 1992

Entropy of fusion

ΔfusS (J/mol*K) Temperature (K) Reference Comment
61.61205.64Lebedev, Kulagina, et al., 1992

References

Lebedev, Kulagina, et al., 1992
Lebedev, B.V.; Kulagina, T.G.; Sheiman, M.S.; Nistratov, V.P., Thermodynamics of the complexes (CH3)2CdxSe(CH3)2 and (CH3)2CdxTe(CH3)2 in the temperature range from 0 to 310 K, J. Chem. Thermodynam., 1992, 24, 673-683. [all data]