Phthalocyanine manganese

Gas phase ion energetics data

Data compiled by: Sharon G. Lias, Rhoda D. Levin, and Sherif A. Kafafi

Ionization energy determinations

IE (eV) Method Reference
7.26 ± 0.10EIEley, Hazeldine, et al., 1973

References

Eley, Hazeldine, et al., 1973
Eley, D.D.; Hazeldine, D.J.; Palmer, T.F., Mass spectra, ionisation potentials and related properties of metal-free transition and metal phthalocyanines, J. Chem. Soc. Faraday Trans. 2, 1973, 69, 1808. [all data]