Silane,(4-methoxyphenyl)dimethyl-

Gas phase ion energetics data

Data compiled as indicated in comments:
B - John E. Bartmess
LLK - Sharon G. Lias, Rhoda D. Levin, and Sherif A. Kafafi

Appearance energy determinations

Ion AE (eV) Other Products MethodReferenceComment
C8H11OSi+8.13CH3EIDube and Chvalovsky, 1974LLK

De-protonation reactions

C9H13OSi- + Hydrogen cation = C9H14OSi

By formula: C9H13OSi- + H+ = C9H14OSi

Quantity Value Units Method Reference Comment
Δr1585. ± 9.2kJ/molG+TSIrie, Kikukawa, et al., 2001gas phase; The anion may be ArSiH(Me)CH2-, based on LFER size and ab initio calculations - JEB; B
Quantity Value Units Method Reference Comment
Δr1553. ± 8.4kJ/molIMREIrie, Kikukawa, et al., 2001gas phase; The anion may be ArSiH(Me)CH2-, based on LFER size and ab initio calculations - JEB; B

References

Dube and Chvalovsky, 1974
Dube, G.; Chvalovsky, V., Electron impact fragmentation of substituted phenyldimethylsilanes, Collect. Czech. Chem. Commun., 1974, 39, 2621. [all data]

Irie, Kikukawa, et al., 2001
Irie, M.; Kikukawa, K.; Shimizu, N.; Mishima, M., Gas-phase acidities of aryldimethylsilanes, J. Chem. Soc. Perkin Trans., 2001, 2, 6, 923-928, https://doi.org/10.1039/b100488n . [all data]