Triphenylphosphinecobalt dinitrosyl bromide

Gas phase ion energetics data

Data compiled by: Henry M. Rosenstock, Keith Draxl, Bruce W. Steiner, and John T. Herron

Ionization energy determinations

IE (eV) Method Reference
7.7EIPignataro, Distefano, et al., 1970

References

Pignataro, Distefano, et al., 1970
Pignataro, S.; Distefano, G.; Nencini, G.; Foffani, A., Mass spectrometric study of paramagnetic and diamagnetic transition metal complexes, Intern. J. Mass Spectrom. Ion Phys., 1970, 3, 479. [all data]