tris(pentane-2,4-dionato-O,O')ytterbium

Phase change data

Data compiled by: William E. Acree, Jr., James S. Chickos

Enthalpy of sublimation

ΔsubH (kJ/mol) Temperature (K) Reference
93.3364. - 404.Smirnov, Marav'eva, et al., 1981

References

Smirnov, Marav'eva, et al., 1981
Smirnov, E.V.; Marav'eva, I.A.; Martynenko, L.I.; Spitsyn, V.I., Zh. Neorg. Khim., 1981, 26, 1709. [all data]