Ruthenium, tris(2,4-pentanedionato)-

Phase change data

Data compiled by: William E. Acree, Jr., James S. Chickos

Quantity Value Units Method Reference Comment
Δsub34.68 ± 0.60kcal/molMERibeiro da Silva, Giera, et al., 1993

Enthalpy of sublimation

ΔsubH (kcal/mol) Temperature (K) Method Reference Comment
30.86 ± 0.48374. - 434.MEMorozova, Zherikova, et al., 2009
35.56 ± 0.41418.MESiddiqi, Siddiqui, et al., 2009Based on data from 394. - 441. K.
30.81 ± 0.45377. - 435.MEIgumenov, Semyannikov, et al., 2007
30.4 ± 0.2423. - 493.N/ABykov, Morozova, et al., 1996
33.39 ± 0.60406.MERibeiro da Silva, Giera, et al., 1993Based on data from 398. - 413. K.

References

Ribeiro da Silva, Giera, et al., 1993
Ribeiro da Silva, Manuel A.V.; Giera, Edward; Monte, Manuel J.S., Vapour pressures and standard molar enthalpy of sublimation of crystalline tris(pentane-2,4-dionato)ruthenium(III), Journal of Alloys and Compounds, 1993, 197, 1, 105-107, https://doi.org/10.1016/0925-8388(93)90627-Y . [all data]

Morozova, Zherikova, et al., 2009
Morozova, N.B.; Zherikova, K.V.; Semyannikov, P.P.; Trubin, S.V.; Igumenov, I.K., Study of temperature dependencies of saturated vapor pressure of ruthenium(III) beta-diketonate derivatives, J Therm Anal Calorim, 2009, 98, 2, 395-399, https://doi.org/10.1007/s10973-009-0309-8 . [all data]

Siddiqi, Siddiqui, et al., 2009
Siddiqi, M. Aslam; Siddiqui, Rehan A.; Atakan, Burak, Thermal Stability, Sublimation Pressures, and Diffusion Coefficients of Anthracene, Pyrene, and Some Metal β-Diketonates, J. Chem. Eng. Data, 2009, 54, 10, 2795-2802, https://doi.org/10.1021/je9001653 . [all data]

Igumenov, Semyannikov, et al., 2007
Igumenov, Igor K.; Semyannikov, Pyotr P.; Trubin, Sergei V.; Morozova, Natalia B.; Gelfond, Nikolay V.; Mischenko, Alexander V.; Norman, John A., Approach to control deposition of ultra thin films from metal organic precursors: Ru deposition, Surface and Coatings Technology, 2007, 201, 22-23, 9003-9008, https://doi.org/10.1016/j.surfcoat.2007.04.129 . [all data]

Bykov, Morozova, et al., 1996
Bykov, A.F.; Morozova, N.B.; Igumenov, I.K.; Sysoev, S.V., Investigation of thermal properties of ruthenium(III) Β-diketonate precursors for preparation of RuO2 films by CVD, Journal of Thermal Analysis, 1996, 46, 6, 1551-1565, https://doi.org/10.1007/BF01980761 . [all data]