tris(pentane-2,4-dionato-O,O')molybdenum

Gas phase thermochemistry data

Data compiled by: José A. Martinho Simões

Quantity Value Units Method Reference Comment
Δfgas-1195. ± 11.kJ/molReviewMartinho Simões

References

Martinho Simões
Martinho Simões, J.A., Private communication (see http://webbook.nist.gov/chemistry/om/). [all data]