Manganic acetylacetonate

Phase change data

Data compiled by: William E. Acree, Jr., James S. Chickos

Quantity Value Units Method Reference Comment
Δsub29.80 ± 0.91kcal/molMEMalkerova, Alikhanyan, et al., 1990Based on data from 320. - 380. K.
Δsub28.7 ± 2.4kcal/molEDa Silva and Ferrao, 1988
Δsub18.6 ± 0.2kcal/molN/APilcher and Skinner, 1983See also Hill and Irving, 1968.

Enthalpy of sublimation

ΔsubH (kcal/mol) Temperature (K) Reference
23.7392.Maslowska and Baranowski, 1981
27.0370.Götze, Bloss, et al., 1970

Enthalpy of fusion

ΔfusH (kcal/mol) Temperature (K) Method Reference
6.62421.9DSCSabolovic, Mrak, et al., 2004

References

Malkerova, Alikhanyan, et al., 1990
Malkerova, I.P.; Alikhanyan, A.S.; Sevast'yanov, V.G.; Grinberg, Ya.Kh.; Gorgoraki, V.I., Thermal behavior of 3d transition metal acetylacetonates, Zh. Neorg. Khim., 1990, 35, 2, 413. [all data]

Da Silva and Ferrao, 1988
Da Silva, Manuel A.V. Ribeiro; Ferrao, M. Luisa C.C.H., Standard enthalpies of formation of tris(β-diketonate)manganese(III) complexes: the mean (Mn---O) bond-dissociation enthalpies, Can. J. Chem., 1988, 66, 4, 651-654, https://doi.org/10.1139/v88-112 . [all data]

Pilcher and Skinner, 1983
Pilcher, G.; Skinner, H.A., Thermochemistry of organometallic compounds, 1983, 43-90, https://doi.org/10.1002/9780470771686.ch2 . [all data]

Hill and Irving, 1968
Hill, J.O.; Irving, R.J., The heat of formation of tris(acetylacetonato)manganese(III) and the manganese?oxygen bond energy, J. Chem. Soc., A, 1968, 3116, https://doi.org/10.1039/j19680003116 . [all data]

Maslowska and Baranowski, 1981
Maslowska, J.; Baranowski, J.B., Chemia Analityczna, 1981, 26, 1017. [all data]

Götze, Bloss, et al., 1970
Götze, H.-J.; Bloss, K.; Molketin, H., Dampfdruckbestimmung von Acetylacetonaten, Zeitschrift für Physikalische Chemie, 1970, 73, 46, 314-320, https://doi.org/10.1524/zpch.1970.73.46.314 . [all data]

Sabolovic, Mrak, et al., 2004
Sabolovic, Jasmina; Mrak, Zeljko; Kostrun, Sanja; Janekovic, August, Is the Enthalpy of Fusion of Tris(acetylacetonato)metal(III) Complexes Affected by Their Potential Energy in the Crystal State?, Inorg. Chem., 2004, 43, 26, 8479-8489, https://doi.org/10.1021/ic048900u . [all data]