1-Propanamine, N-propyl-
- Formula: C6H15N
- Molecular weight: 101.1900
- IUPAC Standard InChIKey: WEHWNAOGRSTTBQ-UHFFFAOYSA-N
- CAS Registry Number: 142-84-7
- Chemical structure:

Gas phase thermochemistry data

Data compiled as indicated in comments:
ALS - Hussein Y. Afeefy, Joel F. Liebman, and Stephen E. Stein
DRB - Donald R. Burgess, Jr.
Quantity | Value | Units | Method | Reference | Comment |
---|---|---|---|---|---|
ΔfH°gas | -116.5 ± 1.6 | kJ/mol | Ccb | Ribeiro da Silva, Ribeiro da Silva, et al., 1997 | ALS |
ΔfH°gas | -118.1 | kJ/mol | N/A | Lebedeva, Katin, et al., 1971 | Value computed using ΔfHliquid° value of -156.2±0.4 kj/mol from Lebedeva, Katin, et al., 1971 and ΔvapH° value of 38.1 kj/mol from Ribeiro da Silva, Ribeiro da Silva, et al., 1997.; DRB |

Condensed phase thermochemistry data

Data compiled by: Hussein Y. Afeefy, Joel F. Liebman, and Stephen E. Stein
Quantity | Value | Units | Method | Reference | Comment |
---|---|---|---|---|---|
ΔfH°liquid | -154.6 ± 1.5 | kJ/mol | Ccb | Ribeiro da Silva, Ribeiro da Silva, et al., 1997 | |
ΔfH°liquid | -156.2 ± 0.42 | kJ/mol | Ccb | Lebedeva, Katin, et al., 1971 | |
Quantity | Value | Units | Method | Reference | Comment |
ΔcH°liquid | -4350.2 ± 1.3 | kJ/mol | Ccb | Ribeiro da Silva, Ribeiro da Silva, et al., 1997 | |
ΔcH°liquid | -4348.68 ± 0.42 | kJ/mol | Ccb | Lebedeva, Katin, et al., 1971 |

Phase change data

Data compiled as indicated in comments:
BS - Robert L. Brown and Stephen E. Stein
TRC - Thermodynamics Research Center, NIST Boulder Laboratories, Chris Muzny director
DRB - Donald R. Burgess, Jr.
AC - William E. Acree, Jr., James S. Chickos
ALS - Hussein Y. Afeefy, Joel F. Liebman, and Stephen E. Stein
Quantity | Value | Units | Method | Reference | Comment |
---|---|---|---|---|---|
Tboil | 383. ± 2. | K | AVG | N/A | Average of 13 values; Individual data points |
Quantity | Value | Units | Method | Reference | Comment |
Tfus | 209.6 | K | N/A | Anonymous, 1958 | Uncertainty assigned by TRC = 0.6 K; TRC |
Tfus | 210.15 | K | N/A | Timmermans and Mattaar, 1921 | Uncertainty assigned by TRC = 0.5 K; TRC |
Tfus | 233.55 | K | N/A | Timmermans, 1921 | Uncertainty assigned by TRC = 0.5 K; TRC |
Quantity | Value | Units | Method | Reference | Comment |
Tc | 555.8 | K | N/A | Toczylkin. L.S. and Young, 1980 | Uncertainty assigned by TRC = 0.55 K; TRC |
Quantity | Value | Units | Method | Reference | Comment |
Pc | 36.30 | bar | N/A | Toczylkin. L.S. and Young, 1980 | Uncertainty assigned by TRC = 0.3627 bar; Visual; TRC |
Quantity | Value | Units | Method | Reference | Comment |
ΔvapH° | 40. ± 2. | kJ/mol | AVG | N/A | Average of 6 values; Individual data points |
Enthalpy of vaporization
ΔvapH (kJ/mol) | Temperature (K) | Method | Reference | Comment |
---|---|---|---|---|
33.47 | 382.4 | N/A | Majer and Svoboda, 1985 | |
40.0 | 336. | N/A | Resa, González, et al., 2000 | Based on data from 321. to 382. K.; AC |
39.8 | 317. | A | Stephenson and Malanowski, 1987 | Based on data from 302. to 422. K. See also Dykyj, 1972.; AC |
41. | 291. | V | Lebedeva, Katin, et al., 1971 | ALS |

Reaction thermochemistry data

Data compiled by: Hussein Y. Afeefy, Joel F. Liebman, and Stephen E. Stein
Individual Reactions
+ C6H13N =
By formula: H2 + C6H13N = C6H15N
Quantity | Value | Units | Method | Reference | Comment |
---|---|---|---|---|---|
ΔrH° | 80.8 ± 0.8 | kJ/mol | Chyd | Jackman and Packham, 1957 | liquid phase; solvent: bis-2-Ethoxyethyl ether |

Henry's Law data

Data compiled by: Rolf Sander
Henry's Law constant (water solution)
kH(T) = k°H exp(d(ln(kH))/d(1/T) ((1/T) - 1/(298.15 K)))
k°H = Henry's law constant for solubility in water at 298.15 K (mol/(kg*bar))
d(ln(kH))/d(1/T) = Temperature dependence constant (K)
k°H (mol/(kg*bar)) | d(ln(kH))/d(1/T) (K) | Method | Reference |
---|---|---|---|
19. | M | N/A |

Gas phase ion energetics data

Data evaluated as indicated in comments:
HL - Edward P. Hunter and Sharon G. Lias
Data compiled as indicated in comments:
LLK - Sharon G. Lias, Rhoda D. Levin, and Sherif A. Kafafi
RDSH - Henry M. Rosenstock, Keith Draxl, Bruce W. Steiner, and John T. Herron
Quantity | Value | Units | Method | Reference | Comment |
---|---|---|---|---|---|
Proton affinity (review) | 230.0 | kcal/mol | N/A | Hunter and Lias, 1998 | HL |
Quantity | Value | Units | Method | Reference | Comment |
Gas basicity | 222.1 | kcal/mol | N/A | Hunter and Lias, 1998 | HL |
Ionization energy determinations
IE (eV) | Method | Reference | Comment |
---|---|---|---|
7.8 ± 0.1 | PE | Aue, Webb, et al., 1976 | LLK |
7.84 ± 0.02 | PI | Watanabe and Mottl, 1957 | RDSH |
8.6 ± 0.3 | PE | Peel and Willett, 1977 | Vertical value; LLK |

Kovats' RI, non-polar column, isothermal

Column type | Active phase | Temperature (C) | I | Reference | Comment |
---|---|---|---|---|---|
Packed | C78, Branched paraffin | 130. | 742.6 | Dallos, Sisak, et al., 2000 | He; Column length: 3.3 m |
Packed | C78, Branched paraffin | 130. | 742.6 | Reddy, Dutoit, et al., 1992 | Chromosorb G HP; Column length: 3.3 m |
Packed | Apolane | 130. | 744. | Dutoit, 1991 | Column length: 3.7 m |
Packed | Apiezon L | 100. | 746. | Golovnya, Zhuravleva, et al., 1982 | Chromosorb G AW (80-100 mesh); Column length: 2.7 m |
Packed | Apiezon L | 100. | 746. | Golovnya, Zhuravleva, et al., 1980 | N2, Chromosorb GAW; Column length: 2.7 m |
Packed | PMS-100 | 130. | 752. | Anderson, Jurel, et al., 1973 | He, Celite 545 (44-60 mesh); Column length: 3. m |
Packed | PMS-100 | 150. | 752. | Anderson, Jurel, et al., 1973 | He, Celite 545 (44-60 mesh); Column length: 3. m |
Packed | PMS-100 | 180. | 750. | Anderson, Jurel, et al., 1973 | He, Celite 545 (44-60 mesh); Column length: 3. m |
Packed | Apiezon L | 100. | 748. | Golovnya and Zhuravleva, 1973 | |
Packed | Apiezon L | 130. | 746. | Landault and Guiochon, 1964 | Teflon-Haloport; Column length: 2.26 m |

Kovats' RI, polar column, isothermal

Column type | Active phase | Temperature (C) | I | Reference | Comment |
---|---|---|---|---|---|
Packed | PEG-2000 | 120. | 901. | Anderson, Jurel, et al., 1973 | He, Celite 545 (44-60 mesh); Column length: 3. m |
Packed | PEG-2000 | 150. | 904. | Anderson, Jurel, et al., 1973 | He, Celite 545 (44-60 mesh); Column length: 3. m |
Packed | PEG-2000 | 152. | 905. | Anderson, Jurel, et al., 1973 | He, Celite 545 (44-60 mesh); Column length: 3. m |
Packed | PEG-2000 | 179. | 900. | Anderson, Jurel, et al., 1973 | He, Celite 545 (44-60 mesh); Column length: 3. m |
Packed | PEG-2000 | 180. | 910. | Anderson, Jurel, et al., 1973 | He, Celite 545 (44-60 mesh); Column length: 3. m |
Packed | PEG-2000 | 200. | 894. | Anderson, Jurel, et al., 1973 | He, Celite 545 (44-60 mesh); Column length: 3. m |

Normal alkane RI, non-polar column, custom temperature program

Column type | Active phase | I | Reference | Comment |
---|---|---|---|---|
Capillary | Methyl Silicone | 748. | Chen and Feng, 2007 | Program: not specified |
Capillary | Methyl Silicone | 745. | Zenkevich, 1999 | Program: not specified |

References

Ribeiro da Silva, Ribeiro da Silva, et al., 1997
Ribeiro da Silva, M.A.V.; Ribeiro da Silva, M.D.M.C.; Luisa, M.; Gomes, A.C.N.; Johnson, M.; Pilcher, G.,
Enthalpies of combustion of di-n-propylamine, diisopropylamine, diisobutylamine, and di-sec-butylamine,
J. Chem. Thermodyn., 1997, 29, 1025-1030. [all data]
Lebedeva, Katin, et al., 1971
Lebedeva, N.D.; Katin, Y.A.; Akhmedova, G.Y.,
Enthalpies of formation of dipropylamine, di-isopropylamine, dibutylamine, and di-isobutylamine,
Russ. J. Phys. Chem. (Engl. Transl.), 1971, 45, 771-772. [all data]
Anonymous, 1958
Anonymous, R.,
, Am. Pet. Inst. Res. Proj. 45, Ohio State Univ., 1958. [all data]
Timmermans and Mattaar, 1921
Timmermans, J.; Mattaar, J.F.,
Freezing points of orgainic substances VI. New experimental determinations.,
Bull. Soc. Chim. Belg., 1921, 30, 213. [all data]
Timmermans, 1921
Timmermans, J.,
The Freezing Points of Organic Substances IV. New Exp. Determinations,
Bull. Soc. Chim. Belg., 1921, 30, 62. [all data]
Toczylkin. L.S. and Young, 1980
Toczylkin. L.S.; Young, C.L.,
Gas-liquid criticl temperatures of mixtures containing electron donors. II. Amine mixtures,
J. Chem. Thermodyn., 1980, 12, 365. [all data]
Majer and Svoboda, 1985
Majer, V.; Svoboda, V.,
Enthalpies of Vaporization of Organic Compounds: A Critical Review and Data Compilation, Blackwell Scientific Publications, Oxford, 1985, 300. [all data]
Resa, González, et al., 2000
Resa, José M.; González, Cristina; Ortiz de Landaluce, Salomé; Lanz, Juan,
Vapor-Liquid Equilibrium of Binary Mixtures Containing Diethylamine + Diisopropylamine, Diethylamine + Dipropylamine, and Chloroform + Diisopropylamine at 101.3 kPa, and Vapor Pressures of Dipropylamine,
J. Chem. Eng. Data, 2000, 45, 5, 867-871, https://doi.org/10.1021/je000020g
. [all data]
Stephenson and Malanowski, 1987
Stephenson, Richard M.; Malanowski, Stanislaw,
Handbook of the Thermodynamics of Organic Compounds, 1987, https://doi.org/10.1007/978-94-009-3173-2
. [all data]
Dykyj, 1972
Dykyj, J.,
Petrochemia, 1972, 12, 1, 13. [all data]
Jackman and Packham, 1957
Jackman, L.M.; Packham, D.I.,
The experimental resonance energy of acridine,
Proc. Chem. Soc., London, 1957, 349-350. [all data]