3-Ethylheptanoic acid

Phase change data

Data compiled by: Thermodynamics Research Center, NIST Boulder Laboratories, Chris Muzny director

Quantity Value Units Method Reference Comment
Tboil509.15KN/APowell and Baldwin, 1936Uncertainty assigned by TRC = 2. K

In addition to the Thermodynamics Research Center (TRC) data available from this site, much more physical and chemical property data is available from the following TRC products:

References

Powell and Baldwin, 1936
Powell, S.G.; Baldwin, M.M., The Condensation of 2-Butanone with Aldehydes of the Type RR'CHCHO, J. Am. Chem. Soc., 1936, 58, 1871. [all data]