C9H7NO

Gas phase ion energetics data

Data compiled by: John E. Bartmess

De-protonation reactions

C9H6NO- + Hydrogen cation = C9H7NO

By formula: C9H6NO- + H+ = C9H7NO

Quantity Value Units Method Reference Comment
Δr1446. ± 8.8kJ/molG+TSTaft and Topsom, 1987gas phase; value altered from reference due to change in acidity scale
Quantity Value Units Method Reference Comment
Δr1418. ± 8.4kJ/molIMRETaft and Topsom, 1987gas phase; value altered from reference due to change in acidity scale

Reaction thermochemistry data

Data compiled by: John E. Bartmess

Individual Reactions

C9H6NO- + Hydrogen cation = C9H7NO

By formula: C9H6NO- + H+ = C9H7NO

Quantity Value Units Method Reference Comment
Δr1446. ± 8.8kJ/molG+TSTaft and Topsom, 1987gas phase; value altered from reference due to change in acidity scale
Quantity Value Units Method Reference Comment
Δr1418. ± 8.4kJ/molIMRETaft and Topsom, 1987gas phase; value altered from reference due to change in acidity scale

References

Taft and Topsom, 1987
Taft, R.W.; Topsom, R.D., The Nature and Analysis of Substituent Effects, Prog. Phys. Org. Chem., 1987, 16, 1. [all data]