bis(monothiothenoyltrifluoroacetonate)nickel (II)

Phase change data

Data compiled by: William E. Acree, Jr., James S. Chickos

Quantity Value Units Method Reference Comment
Δsub161.0 ± 5.1kJ/molCRibeiro da Silva, Santos, et al., 2007

References

Ribeiro da Silva, Santos, et al., 2007
Ribeiro da Silva, Manuel A.V.; Santos, Luís M.N.B.F.; Giera, Edward, Standard molar enthalpies of formation of nickel(II) β-diketonates and monothio-β-diketonates, The Journal of Chemical Thermodynamics, 2007, 39, 3, 361-370, https://doi.org/10.1016/j.jct.2006.08.004 . [all data]