C10H14O2

Reaction thermochemistry data

Data compiled by: John E. Bartmess

Individual Reactions

C10H13O2- + Hydrogen cation = C10H14O2

By formula: C10H13O2- + H+ = C10H14O2

Quantity Value Units Method Reference Comment
Δr1428. ± 9.2kJ/molG+TSTaft and Topsom, 1987gas phase; value altered from reference due to change in acidity scale
Quantity Value Units Method Reference Comment
Δr1399. ± 8.4kJ/molIMRETaft and Topsom, 1987gas phase; value altered from reference due to change in acidity scale

Gas phase ion energetics data

Data compiled by: John E. Bartmess

De-protonation reactions

C10H13O2- + Hydrogen cation = C10H14O2

By formula: C10H13O2- + H+ = C10H14O2

Quantity Value Units Method Reference Comment
Δr341.4 ± 2.2kcal/molG+TSTaft and Topsom, 1987gas phase; value altered from reference due to change in acidity scale
Quantity Value Units Method Reference Comment
Δr334.4 ± 2.0kcal/molIMRETaft and Topsom, 1987gas phase; value altered from reference due to change in acidity scale

References

Taft and Topsom, 1987
Taft, R.W.; Topsom, R.D., The Nature and Analysis of Substituent Effects, Prog. Phys. Org. Chem., 1987, 16, 1. [all data]