N-Fluoro-sec-butylnitramine

Condensed phase thermochemistry data

Data compiled by: Hussein Y. Afeefy, Joel F. Liebman, and Stephen E. Stein

Quantity Value Units Method Reference Comment
Δfliquid-38.6 ± 2.1kcal/molCcbZimmer, Baroody, et al., 1966Corrected for CODATA value of ΔfH
Quantity Value Units Method Reference Comment
Δcliquid-687.8 ± 2.1kcal/molCcbZimmer, Baroody, et al., 1966Corrected for CODATA value of ΔfH
Quantity Value Units Method Reference Comment
Δfsolid-37.99kcal/molCcrBaroody and Carpenter, 1972Not corrected for CODATA value of ΔfH

References

Zimmer, Baroody, et al., 1966
Zimmer, M.F.; Baroody, E.E.; Graff, M.G.; Carpenter, G.A.; Robb, R.A., Heats of formation and bond energies of N-fluoro-N-nitrobutylamine isomers, J. Chem. Eng. Data, 1966, 11, 579-581. [all data]

Baroody and Carpenter, 1972
Baroody, E.E.; Carpenter, G.A., Heats of formation of propellant compounds (U), Rpt. Naval Ordnance Systems Command Task No. 331-003/067-1/UR2402-001 for Naval Ordance Station, Indian Head, MD, 1972, 1-9. [all data]