Bis-(tetrafluoropropyl)carbonate

Condensed phase thermochemistry data

Data compiled by: Eugene S. Domalski and Elizabeth D. Hearing

Quantity Value Units Method Reference Comment
liquid539.02J/mol*KN/ALebedeva, Dobychin, et al., 1980

Constant pressure heat capacity of liquid

Cp,liquid (J/mol*K) Temperature (K) Reference Comment
389.87298.15Lebedeva, Dobychin, et al., 1980T = 12 to 360 K. Data given in tables and by equations.

References

Lebedeva, Dobychin, et al., 1980
Lebedeva, N.D.; Dobychin, S.L.; Stepanov, V.B.; Katin, Yu.A.; Kozlova, N.M., Heat capacity, thermodynamic functions, and vapor pressure of bis-(tetrafluoropropyl)-carbonate, Zhur. Prikl. Khim., 1980, 52, 803-806. [all data]