2-Propenoic acid, 2-methyl-, hexyl ester

Kovats' RI, non-polar column, isothermal

View large format table.

Column type Active phase Temperature (C) I Reference Comment
CapillaryOV-101120.1161.Horna, Táborský, et al., 1985N2; Column length: 19. m; Column diameter: 0.28 mm
CapillaryOV-101170.1158.Horna, Táborský, et al., 1985N2; Column length: 19. m; Column diameter: 0.28 mm
CapillaryOV-101200.1158.Horna, Táborský, et al., 1985N2; Column length: 19. m; Column diameter: 0.28 mm
CapillaryOV-10180.1164.Horna, Táborský, et al., 1985N2; Column length: 19. m; Column diameter: 0.28 mm
PackedSE-30150.1144.Ashes and Haken, 1975He, Celatom silanized (62-72 mesh); Column length: 3.7 m
PackedOV-1150.1165.Ashes and Haken, 1971
PackedSE-30150.1165.Allen and Haken, 1970Celite 560 silanized; Column length: 3.7 m
PackedSE-30150.1165.Germaine and Haken, 1969Celite 560; Column length: 3.7 m

Kovats' RI, polar column, isothermal

View large format table.

Column type Active phase Temperature (C) I Reference Comment
CapillarySP-1000120.1424.Horna, Táborský, et al., 1985N2; Column length: 46. m; Column diameter: 0.23 mm
CapillarySP-1000170.1435.Horna, Táborský, et al., 1985N2; Column length: 46. m; Column diameter: 0.23 mm
CapillarySP-1000200.1439.Horna, Táborský, et al., 1985N2; Column length: 46. m; Column diameter: 0.23 mm
CapillarySP-100080.1409.Horna, Táborský, et al., 1985N2; Column length: 46. m; Column diameter: 0.23 mm

References

Horna, Táborský, et al., 1985
Horna, A.; Táborský, J.; Dufka, O.; Matousek, P.; Churácek, J., Chromatography of monomers. II. Glass capillary gas chromatography of C1-C18 alkyl esters of acrylic and methacrylic acids, J. Chromatogr., 1985, 325, 367-378, https://doi.org/10.1016/S0021-9673(00)96047-3 . [all data]

Ashes and Haken, 1975
Ashes, J.R.; Haken, J.K., Gas chromatography of homologous esters. IX. Structure-retention increments of unsaturated esters, J. Chromatogr., 1975, 111, 1, 171-187, https://doi.org/10.1016/S0021-9673(01)80159-X . [all data]

Ashes and Haken, 1971
Ashes, J.R.; Haken, J.K., Gas chromatography of homologous esters. Part V. Retention of aliphatic esters on non-polar, donar and acceptor stationary phases, J. Chromatogr., 1971, 60, 33-44, https://doi.org/10.1016/S0021-9673(00)95527-4 . [all data]

Allen and Haken, 1970
Allen, I.D.; Haken, J.K., Gas chromatography of homologous esters. Part IV. Influence of stationary phase polarity on retention of unsaturated esters, J. Chromatogr., 1970, 51, 415-422, https://doi.org/10.1016/S0021-9673(01)96890-6 . [all data]

Germaine and Haken, 1969
Germaine, R.W.; Haken, J.K., Gas chromatography of homologous esters. Part 2. Unsaturated esters, J. Chromatogr., 1969, 43, 43-47, https://doi.org/10.1016/S0021-9673(00)99163-5 . [all data]