D-Glucitol, 6TMS derivative

Kovats' RI, non-polar column, isothermal

View large format table.

Column type Active phase Temperature (C) I Reference Comment
CapillaryOV-101200.2000.1Adam, 1981Column length: 50. m

Kovats' RI, non-polar column, temperature ramp

View large format table.

Column type Active phase I Reference Comment
CapillaryDB-5MS1981.Medeiros and Simoneit, 200730. m/0.25 mm/0.25 μm, He, 65. C @ 2. min, 6. K/min, 300. C @ 15. min

Van Den Dool and Kratz RI, non-polar column, temperature ramp

View large format table.

Column type Active phase I Reference Comment
CapillaryDB-5MS1935.1Jonsson, Johansson, et al., 200510. m/0.18 mm/0.18 μm, 70. C @ 2. min, 40. K/min, 320. C @ 2. min
CapillaryRTX-5Sil1931.1Wagner, Sefkow, et al., 200380. C @ 2. min, 18. K/min, 350. C @ 2. min; Column length: 30. m; Column diameter: 0.25 mm

Van Den Dool and Kratz RI, non-polar column, custom temperature program

View large format table.

Column type Active phase I Reference Comment
CapillaryHP-51982.Madaj, Wisniewski, et al., 1993H2; Column length: 50. m; Column diameter: 0.20 mm; Program: 115 0C 3 0C/min -> 180 0C 4 0C/min -> 250 0C

Normal alkane RI, non-polar column, isothermal

View large format table.

Column type Active phase Temperature (C) I Reference Comment
CapillaryOV-101175.2005.Zegota, 1980Column length: 50. m; Column diameter: 0.30 mm
CapillarySE-30165.2020.Zegota, 198035; Column diameter: 0.30 mm

Normal alkane RI, non-polar column, temperature ramp

View large format table.

Column type Active phase I Reference Comment
CapillaryHP-51979.Isidorov, Lech, et al., 200830. m/0.25 mm/0.25 μm, Helium, 3. K/min, 300. C @ 30. min; Tstart: 50. C

Normal alkane RI, non-polar column, custom temperature program

View large format table.

Column type Active phase I Reference Comment
CapillaryHP-51982.Isidorov, Lech, et al., 200830. m/0.25 mm/0.25 μm, Helium; Program: not specified

References

Adam, 1981
Adam, S., Separation of mono- and di-saccharide derivatives by high-resolution gas chromatography, Z. Lebensm. Unters. Forsch., 1981, 173, 2, 109-112, https://doi.org/10.1007/BF01042273 . [all data]

Medeiros and Simoneit, 2007
Medeiros, P.M.; Simoneit, B.R.T., Analysis of sugars in environmental samples by gas chromatography-mass spectrometry, J. Chromatogr. A, 2007, 1141, 2, 271-278, https://doi.org/10.1016/j.chroma.2006.12.017 . [all data]

Jonsson, Johansson, et al., 2005
Jonsson, P.; Johansson, A.I.; Gullberg, J.; Trygg, J.; Jiye, A.; Grung, B.; Marklund, S.; Sjöström, M.; Antti, H.; Moritz, T., High-throughput data analysis for detecting and identifying differences between samples in GC/MS-based metabolomic analyses, Anal. Chem., 2005, 77, 17, 5635-5642, https://doi.org/10.1021/ac050601e . [all data]

Wagner, Sefkow, et al., 2003
Wagner, C.; Sefkow, M.; Kopka, J., Construction and application of a mass spectral and retention time index database generated from plant GC/EI-TOF-MS metabolite profiles, Phytochemistry, 2003, 62, 6, 887-900, https://doi.org/10.1016/S0031-9422(02)00703-3 . [all data]

Madaj, Wisniewski, et al., 1993
Madaj, J.; Wisniewski, A.; Skorupowa, E.; Sokolowski, J., Capillary gas chromatographic separations of a multicomponent mixture of polyalcohol compounds, J. Chromatogr. A, 1993, 655, 2, 267-273, https://doi.org/10.1016/0021-9673(93)83232-H . [all data]

Zegota, 1980
Zegota, H., Separation and quantitative determination of fructose as the O-methyloxime by gas-liquid chromatography using glass capillary columns, J. Chromatogr., 1980, 192, 2, 446-451, https://doi.org/10.1016/S0021-9673(80)80024-0 . [all data]

Isidorov, Lech, et al., 2008
Isidorov, V.A.; Lech, P.; Zolciak, A.; Rusak, N.; Szczepaniak, L., Gas Chromatographic - nass spectrometric investigation of metabolites from the needles and roots of pine seedlings at early stages of pathogenic fungi Armillaria ostoyae attack, Trees, 2008, 22, 4, 531-542, https://doi.org/10.1007/s00468-008-0213-z . [all data]