OGeS

Vibrational and/or electronic energy levels

Data compiled by: Marilyn E. Jacox

State:   X

Vib.
sym.
 No.   Approximate
 type of mode
 cm-1   Med.   Method   References

Σ+ 1 GeO stretch 984.3 Ar IR Hassanzadeh and Andrews, 1992

Additional references: Jacox, 1994, page 86

References

Hassanzadeh and Andrews, 1992
Hassanzadeh, P.; Andrews, L., Infrared spectra of germanium sulfide, germanium disulfide, germanium oxide sulfide and germanium dioxide in solid argon, J. Phys. Chem., 1992, 96, 15, 6181, https://doi.org/10.1021/j100194a018 . [all data]

Jacox, 1994
Jacox, M.E., Vibrational and electronic energy levels of polyatomic transient molecules, American Chemical Society, Washington, DC, 1994, 464. [all data]