Chromium(III) trisO,O'-(diethyldithiophosphate)

Gas phase ion energetics data

Data compiled by: Sharon G. Lias, Rhoda D. Levin, and Sherif A. Kafafi

Ionization energy determinations

IE (eV) Method Reference Comment
7.71PECiliberto, Costanzo, et al., 1980Vertical value

References

Ciliberto, Costanzo, et al., 1980
Ciliberto, E.; Costanzo, L.L.; Fragala, I.; Granozzi, G., Ultraviolet photoelectron spectra of `octahedral' (diethyldithiophosphato) metal(III) complexes, Inorg. Chim. Acta, 1980, 44, 25. [all data]