In2P

Vibrational and/or electronic energy levels

Data compiled by: Marilyn E. Jacox

State:   A

 Energy
 (cm-1
 Med.   Transition   λmin
 (nm)
 λmax
 (nm)

References

To = 1860 T gas Xu, de Beer, et al., 1994
Arnold and Neumark, 1994

State:   X

Vib.
sym.
 No.   Approximate
 type of mode
 cm-1   Med.   Method   References

a1 1 Sym. stretch 204 ± 2 gas TPE Arnold and Neumark, 1994
2 Bend 47.0 ± 0.3 gas TPE Arnold and Neumark, 1994
b2 3 Asym. stretch 249.3 Ar IR Li, Van Zee, et al., 1994

Additional references: Jacox, 1998, page 165; Jacox, 2003, page 64

Xu, de Beer, et al., 1994
Xu, C.; de Beer, E.; Arnold, D.W.; Arnold, C.C.; Neumark, D.M., Anion photoelectron spectroscopy of small indium phosphide clusters (InxP-y; x,y=1--4), J. Chem. Phys., 1994, 101, 6, 5406, https://doi.org/10.1063/1.467393 . [all data]

Arnold and Neumark, 1994
Arnold, C.C.; Neumark, D.M., Study of In2P/In2P- and InP2/InP2- using negative ion zero electron kinetic energy spectroscopy, Can. J. Phys., 1994, 72, 11-12, 1322, https://doi.org/10.1139/p94-168 . [all data]

Li, Van Zee, et al., 1994
Li, S.; Van Zee, R.J.; Weltner, W., Jr., Infrared spectra of InP, InAs, and InSb molecules in rare-gas matrixes at 4 K: magnetic effects, J. Phys. Chem., 1994, 98, 9, 2275, https://doi.org/10.1021/j100060a010 . [all data]

Jacox, 1998
Jacox, M.E., Vibrational and electronic energy levels of polyatomic transient molecules: supplement A, J. Phys. Chem. Ref. Data, 1998, 27, 2, 115-393, https://doi.org/10.1063/1.556017 . [all data]

Jacox, 2003
Jacox, M.E., Vibrational and electronic energy levels of polyatomic transient molecules: supplement B, J. Phys. Chem. Ref. Data, 2003, 32, 1, 1-441, https://doi.org/10.1063/1.1497629 . [all data]