Nitrogen cation

Gas phase thermochemistry data

Quantity Value Units Method Reference Comment
gas,1 bar159.79J/mol*KReviewChase, 1998Data last reviewed in December, 1982

Reaction thermochemistry data

Data compiled by: Michael M. Meot-Ner (Mautner) and Sharon G. Lias

Individual Reactions

N+ + Nitrogen = (N+ • Nitrogen)

By formula: N+ + N2 = (N+ • N2)

Quantity Value Units Method Reference Comment
Δr249.kJ/molN/ANational Bureau of Standards, 1968gas phase; from ΔrH(f)
Δr250.kJ/molEISaporoschenko, 1965gas phase
Δr250.kJ/molEIFranklin, Dibeler, et al., 1958gas phase

Enthalpy of reaction

ΔrH° (kJ/mol) T (K) Method Reference Comment
361. (+7.5,-0.) CIDHaynes, Freysinger, et al., 1995gas phase; guided ion beam CID

N+ + Argon = (N+ • Argon)

By formula: N+ + Ar = (N+ • Ar)

Enthalpy of reaction

ΔrH° (kJ/mol) T (K) Method Reference Comment
118. (+44.,-0.) CIDHaynes, Freysinger, et al., 1995gas phase; giuded ion beam CID

Ion clustering data

Data compiled by: Michael M. Meot-Ner (Mautner) and Sharon G. Lias

Clustering reactions

N+ + Argon = (N+ • Argon)

By formula: N+ + Ar = (N+ • Ar)

Enthalpy of reaction

ΔrH° (kJ/mol) T (K) Method Reference Comment
118. (+44.,-0.) CIDHaynes, Freysinger, et al., 1995gas phase; giuded ion beam CID

N+ + Nitrogen = (N+ • Nitrogen)

By formula: N+ + N2 = (N+ • N2)

Quantity Value Units Method Reference Comment
Δr249.kJ/molN/ANational Bureau of Standards, 1968gas phase; from ΔrH(f)
Δr250.kJ/molEISaporoschenko, 1965gas phase
Δr250.kJ/molEIFranklin, Dibeler, et al., 1958gas phase

Enthalpy of reaction

ΔrH° (kJ/mol) T (K) Method Reference Comment
361. (+7.5,-0.) CIDHaynes, Freysinger, et al., 1995gas phase; guided ion beam CID

References

Chase, 1998
Chase, M.W., Jr., NIST-JANAF Themochemical Tables, Fourth Edition, J. Phys. Chem. Ref. Data, Monograph 9, 1998, 1-1951. [all data]

National Bureau of Standards, 1968
National Bureau of Standards, US, Technical Note 270 - 3 in The NBS Tables of Chemical Thermodynamic Properties, 1968. [all data]

Saporoschenko, 1965
Saporoschenko, M., Mobility of Mass Analyzed N+, N2+, N3+, and N4+ Ions in Nitrogen Gas, Phys. Rev. A, 1965, 139, 352. [all data]

Franklin, Dibeler, et al., 1958
Franklin, J.L.; Dibeler, V.H.; Reese, R.M.; Krauss, M., Ionization and dissociation of hydrazoic acid and methyl azide by electron impact, J. Am. Chem. Soc., 1958, 80, 298. [all data]

Haynes, Freysinger, et al., 1995
Haynes, C.L.; Freysinger, W.; Armentrout, P.B., Collision-induced dissociation of N3+(X3-) with Ne, Ar, Kr, and Xe, Int. J. Mass Spectrom. Ion Processes, 1995, 149/150, 267. [all data]