1-Aminononadecane

Phase change data

Data compiled as indicated in comments:
BS - Robert L. Brown and Stephen E. Stein
TRC - Thermodynamics Research Center, NIST Boulder Laboratories, Chris Muzny director

Quantity Value Units Method Reference Comment
Tboil633.KN/AAmerican Tokyo Kasei, 1988BS
Quantity Value Units Method Reference Comment
Tfus327.65KN/AStaudinger and Roessler, 1936Uncertainty assigned by TRC = 2. K; TRC

In addition to the Thermodynamics Research Center (TRC) data available from this site, much more physical and chemical property data is available from the following TRC products:

References

American Tokyo Kasei, 1988
American Tokyo Kasei, TCI American Organic Chemical 88/89 Catalog, American Tokyo Kasei, Portland, OR, 1988, 1610. [all data]

Staudinger and Roessler, 1936
Staudinger, H.; Roessler, K., Highly Polymerized Compounds. CXXIII. Viscosity Measurements on Long- Chain Aliphatic Amines., Chem. Ber., 1936, 69B, 49-60. [all data]