4-Octen-3-one

Van Den Dool and Kratz RI, polar column, temperature ramp

Data compiled by: NIST Mass Spectrometry Data Center, William E. Wallace, director

Column type Capillary
Active phase DB-Wax
Column length (m) 60.
Carrier gas He
Substrate
Column diameter (mm) 0.25
Phase thickness (μm) 0.25
Tstart (C) 50.
Tend (C) 230.
Heat rate (K/min) 2.
Initial hold (min)
Final hold (min) 60.
I 1303.
ReferenceShimoda, Shiratsuchi, et al., 1996
Comment MSDC-RI

References

Shimoda, Shiratsuchi, et al., 1996
Shimoda, M.; Shiratsuchi, H.; Nakada, Y.; Wu, Y.; Osajima, Y., Identification and sensory characterization of volatile flavor compounds in sesame seed oil, J. Agric. Food Chem., 1996, 44, 12, 3909-3912, https://doi.org/10.1021/jf960115f . [all data]