In11

Gas phase ion energetics data

Data compiled by: John E. Bartmess

Electron affinity determinations

EA (eV) Method Reference Comment
2.630 ± 0.060LPESAkutsu, Koyasu, et al., 2007
2.34 ± 0.20LPESGausa, Ganteför, et al., 1990EA=E(threshold), or upper bound to EA. EA=+0.15/-0.25 eV

References

Akutsu, Koyasu, et al., 2007
Akutsu, M.; Koyasu, K.; Atobe, J.; Miyajima, K.; Mitsui, M.; Nakajima, A., Electronic Properties of Si and Ge Atoms Doped In Clusters: InnSim and InnGem, J. Phys. Chem. A, 2007, 111, 4, 573-577., https://doi.org/10.1021/jp065921w . [all data]

Gausa, Ganteför, et al., 1990
Gausa, M.; Ganteför, G.; Lutz, H.O.; Meiwes-Broer, K.-H., Electronic Structure of Group III Heavy Element Clusters Studied by Photoelectron Spectroscopy, Int. J. Mass Spectrom. Ion Proc., 1990, 102, 227, https://doi.org/10.1016/0168-1176(90)80062-8 . [all data]