Tungsten difluoride dioxide

Gas phase ion energetics data

Data compiled as indicated in comments:
LLK - Sharon G. Lias, Rhoda D. Levin, and Sherif A. Kafafi
RDSH - Henry M. Rosenstock, Keith Draxl, Bruce W. Steiner, and John T. Herron

Ionization energy determinations

IE (eV) Method Reference Comment
12.5 ± 0.3EIMalkerova, Mel'nichenko, et al., 1981LLK
13.0 ± 0.3EIZmbov, Uy, et al., 1969RDSH

Appearance energy determinations

Ion AE (eV) Other Products MethodReferenceComment
WOF+23.6 ± 0.5?EIZmbov, Uy, et al., 1969RDSH
WO2F+16.3 ± 0.5FEIZmbov, Uy, et al., 1969RDSH
WF+27.6 ± 0.5?EIZmbov, Uy, et al., 1969RDSH
WF+32.1 ± 0.8?EIZmbov, Uy, et al., 1969RDSH
WOF2+18.4 ± 0.5OEIZmbov, Uy, et al., 1969RDSH
WO2+21.0 ± 0.5?EIZmbov, Uy, et al., 1969RDSH
W+37.4 ± 1.0?EIZmbov, Uy, et al., 1969RDSH

References

Malkerova, Mel'nichenko, et al., 1981
Malkerova, I.P.; Mel'nichenko, E.I.; Alikhanvan, E.G.; Gorgoraki, V.I., Thermal decomposition of the tungsten oxide fluorides W2O4FO2(NOF) and W2O4F, Russ. J. Inorg. Chem., 1981, 26, 17. [all data]

Zmbov, Uy, et al., 1969
Zmbov, K.F.; Uy, O.M.; Margrave, J.L., Mass spectrometric studies at high temperatures. XXXI. Stabilities of tungsten and molybdenum oxyfluorides, J. Phys. Chem., 1969, 73, 3008. [all data]