CAS Reg. No. 141171-04-2

Reaction thermochemistry data

Data compiled by: John E. Bartmess

Individual Reactions

(CAS Reg. No. 141171-04-2 • 4294967295Phosphorus dimer) + Phosphorus dimer = CAS Reg. No. 141171-04-2

By formula: (CAS Reg. No. 141171-04-2 • 4294967295P2) + P2 = CAS Reg. No. 141171-04-2

Quantity Value Units Method Reference Comment
Δr34.4 ± 2.5kcal/molIMRBO'Hair, Krempp, et al., 1992gas phase; Fluoride affinity: Between H2S, MeSH
Δr33.0 ± 8.1kcal/molTherO'Hair, Krempp, et al., 1992gas phase; Acidity between MeSH, H2S

References

O'Hair, Krempp, et al., 1992
O'Hair, R.A.J.; Krempp, M.; Damrauer, R.; Depuy, C.H., Gas-Phase Ion Chemistry of HP2(-), FP2(-), and HP2(+), Inorg. Chem., 1992, 31, 11, 2092, https://doi.org/10.1021/ic00037a021 . [all data]