6-Octen-1-ol, 3,7-dimethyl-, propanoate

Normal alkane RI, non-polar column, custom temperature program

Data compiled by: NIST Mass Spectrometry Data Center, William E. Wallace, director

Column type CapillaryCapillaryCapillary
Active phase DB-1SE-30DB-1
Column length (m) 60. 60.
Carrier gas Helium He
Substrate
Column diameter (mm) 0.25 0.32
Phase thickness (μm) 0.25 0.25
Program 50 0C (5 min) 3 0C/min -> 120 0C 5 0C/min -> 250 0C (3 min) 15 0C/min -> 300 0C (20 min)not specifiednot specified
I 1427.1427.1428.
ReferenceDelort and Jaquier, 2009Vinogradov, 2004Nishimura, 1995
Comment MSDC-RI MSDC-RI MSDC-RI

Kovats' RI, non-polar column, temperature ramp

Data compiled by: NIST Mass Spectrometry Data Center, William E. Wallace, director

Column type CapillaryCapillaryCapillaryCapillaryCapillary
Active phase HP-5MSHP-5MSSPB-5Cross-Linked MethylsiliconeBP-1
Column length (m) 60.30.60.50.25.
Carrier gas HeHeHeHeN2
Substrate
Column diameter (mm) 0.250.250.320.20.55
Phase thickness (μm) 0.250.251.0.250.25
Tstart (C) 40.50.60.100.60.
Tend (C) 250.250.200.280.220.
Heat rate (K/min) 3.3.4.4.5.
Initial hold (min) 1.10.
Final hold (min) 20.5.30. 15.
I 1446.1446.1437.1428.1429.
ReferenceJalali-Heravi, Zekavat, et al., 2006Asuming, Beauchamp, et al., 2005Gauvin, Lecomte, et al., 2004Rajeswara Rao, Kaul, et al., 2002Jain, Aggarwal, et al., 2001
Comment MSDC-RI MSDC-RI MSDC-RI MSDC-RI MSDC-RI
Column type Capillary
Active phase DB-5
Column length (m) 30.
Carrier gas He
Substrate
Column diameter (mm) 0.26
Phase thickness (μm) 0.25
Tstart (C) 60.
Tend (C) 246.
Heat rate (K/min) 3.
Initial hold (min)
Final hold (min)
I 1444.
ReferenceAdams, 2000
Comment MSDC-RI

References

Delort and Jaquier, 2009
Delort, E.; Jaquier, A., Novel terpenyl esters from Australian finger lime (Citrus australasica) peel extract, Flav. Fragr. J., 2009, 24, 3, 123-132, https://doi.org/10.1002/ffj.1922 . [all data]

Vinogradov, 2004
Vinogradov, B.A., Production, composition, properties and application of essential oils, 2004, retrieved from http://viness.narod.ru. [all data]

Nishimura, 1995
Nishimura, O., Application of a thermal desorption cold trap injector to multidimensional GC and GC-MS, J. Hi. Res. Chromatogr., 1995, 18, 11, 699-704, https://doi.org/10.1002/jhrc.1240181105 . [all data]