3,5,9-Undecatrien-2-one, 6,10-dimethyl-

Van Den Dool and Kratz RI, non-polar column, temperature ramp

Data compiled by: NIST Mass Spectrometry Data Center, William E. Wallace, director

Column type CapillaryCapillary
Active phase DB-5DB-5
Column length (m) 30.30.
Carrier gas HeHe
Substrate
Column diameter (mm) 0.250.25
Phase thickness (μm)
Tstart (C) 50.50.
Tend (C) 250.250.
Heat rate (K/min) 4.4.
Initial hold (min)
Final hold (min)
I 1527.1581.
ReferenceGómez, Ledbetter, et al., 1993Gómez, Ledbetter, et al., 1993
Comment MSDC-RI MSDC-RI

Kovats' RI, non-polar column, isothermal

Data compiled by: NIST Mass Spectrometry Data Center, William E. Wallace, director

Column type CapillaryCapillary
Active phase SE-30SE-30
Column length (m) 40.40.
Carrier gas
Substrate
Column diameter (mm) 0.350.35
Phase thickness (μm) 0.350.35
Temperature (C) 100.100.
I 1507.91557.6
ReferenceTudor, 1997Tudor, 1997
Comment MSDC-RI MSDC-RI

References

Gómez, Ledbetter, et al., 1993
Gómez, E.; Ledbetter, C.A.; Hartsell, P.L., Volatile compounds in apricot, plum, and their interspecific hybrids, J. Agric. Food Chem., 1993, 41, 10, 1669-1676, https://doi.org/10.1021/jf00034a029 . [all data]