Methylthio-2-propanone

Van Den Dool and Kratz RI, non-polar column, temperature ramp

Data compiled by: NIST Mass Spectrometry Data Center, William E. Wallace, director

Column type CapillaryCapillary
Active phase BPX-5BPX-5
Column length (m) 50.50.
Carrier gas  He
Substrate
Column diameter (mm) 0.320.32
Phase thickness (μm) 0.50.50
Tstart (C) 60.40.
Tend (C) 250.280.
Heat rate (K/min) 4.4.
Initial hold (min) 5.
Final hold (min) 20.
I 863.863.
ReferenceBredie, Mottram, et al., 2002Aaslyng, Elmore, et al., 1998
Comment MSDC-RI MSDC-RI

References

Bredie, Mottram, et al., 2002
Bredie, W.L.P.; Mottram, D.S.; Guy, R.C.E., Effect of temperature and pH on the generation of flavor volatiles in extrusion cooking of wheat flour, J. Agric. Food Chem., 2002, 50, 5, 1118-1125, https://doi.org/10.1021/jf0111662 . [all data]

Aaslyng, Elmore, et al., 1998
Aaslyng, M.D.; Elmore, J.S.; Mottram, D.S., Comparison of the aroma characteristics of acid-hydrolyzed and enzyme-hydrolyzed vegetable proteins produced from soy, J. Agric. Food Chem., 1998, 46, 12, 5225-5231, https://doi.org/10.1021/jf9806816 . [all data]