[2H]hydrogen iodide

Gas phase ion energetics data

Data compiled by: Sharon G. Lias, Rhoda D. Levin, and Sherif A. Kafafi

Ionization energy determinations

IE (eV) Method Reference
10.387SEland and Berkowitz, 1977

References

Eland and Berkowitz, 1977
Eland, J.H.D.; Berkowitz, J., Photoionization mass spectrometry of HI and DI at high resolution, J. Chem. Phys., 1977, 67, 5034. [all data]