Boron oxide anion

Reaction thermochemistry data

Data compiled by: John E. Bartmess

Individual Reactions

BO2- + Hydrogen cation = HBO2

By formula: BO2- + H+ = HBO2

Quantity Value Units Method Reference Comment
Δr1351. ± 23.kJ/molD-EAZhai, Wang, et al., 2007gas phase
Δr1356. ± 26.kJ/molD-EASidorov, Rudnyi, et al., 1983gas phase; value altered from reference due to conversion from electron convention to ion convention

References

Zhai, Wang, et al., 2007
Zhai, H.J.; Wang, L.M.; Li, S.D.; Wang, L.S., Vibrationally resolved photoelectron spectroscopy of BO- and BO2-: A joint experimental and theoretical study, J. Phys. Chem. A, 2007, 111, 6, 1030-1035, https://doi.org/10.1021/jp0666939 . [all data]

Sidorov, Rudnyi, et al., 1983
Sidorov, L.N.; Rudnyi, E.B.; Nikitin, M.I.; Sorokin, I.D., Gas Phase Anion Exchange Reactions and the Determination of the Heats of Formation of Metaphosphate (PO3-), metaborate (BO2-), and perrhennate (ReO4-), Dokl. Akad. Nauk SSSR Ser. Khim., 1983, 272, 1172. [all data]