Iron ion (1+)

Ion clustering data

Data compiled as indicated in comments:
RCD - Robert C. Dunbar
M - Michael M. Meot-Ner (Mautner) and Sharon G. Lias

Clustering reactions

Iron ion (1+) + Argon = (Iron ion (1+) • Argon)

By formula: Fe+ + Ar = (Fe+ • Ar)

Quantity Value Units Method Reference Comment
Δr2.6 ± 1.9kcal/molCIDTRodgers and Armentrout, 2000RCD

Iron ion (1+) + Formaldehyde = (Iron ion (1+) • Formaldehyde)

By formula: Fe+ + CH2O = (Fe+ • CH2O)

Quantity Value Units Method Reference Comment
Δr33.0 ± 1.7kcal/molCIDTRodgers and Armentrout, 2000RCD

(Iron ion (1+) • Formaldehyde) + Formaldehyde = (Iron ion (1+) • 2Formaldehyde)

By formula: (Fe+ • CH2O) + CH2O = (Fe+ • 2CH2O)

Quantity Value Units Method Reference Comment
Δr39.2 ± 1.0kcal/molCIDTRodgers and Armentrout, 2000RCD

(Iron ion (1+) • 2Formaldehyde) + Formaldehyde = (Iron ion (1+) • 3Formaldehyde)

By formula: (Fe+ • 2CH2O) + CH2O = (Fe+ • 3CH2O)

Quantity Value Units Method Reference Comment
Δr18.2 ± 1.0kcal/molCIDTRodgers and Armentrout, 2000RCD

(Iron ion (1+) • 3Formaldehyde) + Formaldehyde = (Iron ion (1+) • 4Formaldehyde)

By formula: (Fe+ • 3CH2O) + CH2O = (Fe+ • 4CH2O)

Quantity Value Units Method Reference Comment
Δr12.0 ± 1.7kcal/molCIDTRodgers and Armentrout, 2000RCD

Iron ion (1+) + Methyl radical = (Iron ion (1+) • Methyl radical)

By formula: Fe+ + CH3 = (Fe+ • CH3)

Quantity Value Units Method Reference Comment
Δr57.3 ± 3.0kcal/molCIDTFisher, Schultz, et al., 1989RCD
Δr56.9 ± 1.6kcal/molCIDTFisher, Schultz, et al., 1989RCD
Δr57.9 ± 2.4kcal/molCIDTSchultz, Elkind, et al., 1988RCD

Iron ion (1+) + CH4Si = (Iron ion (1+) • CH4Si)

By formula: Fe+ + CH4Si = (Fe+ • CH4Si)

Quantity Value Units Method Reference Comment
Δr62.5 ± 7.5kcal/molICRJacobson and Bakhtiar, 1993gas phase; M

Iron ion (1+) + CH4Si = (Iron ion (1+) • CH4Si)

By formula: Fe+ + CH4Si = (Fe+ • CH4Si)

Quantity Value Units Method Reference Comment
Δr67. ± 11.kcal/molICRJacobson and Bakhtiar, 1993gas phase; M

Iron ion (1+) + Methane = (Iron ion (1+) • Methane)

By formula: Fe+ + CH4 = (Fe+ • CH4)

Enthalpy of reaction

ΔrH° (kcal/mol) T (K) Method Reference Comment
13.6 (+0.7,-0.) CIDArmentrout and Kickel, 1994gas phase; guided ion beam CID; M

(Iron ion (1+) • Methane) + Methane = (Iron ion (1+) • 2Methane)

By formula: (Fe+ • CH4) + CH4 = (Fe+ • 2CH4)

Enthalpy of reaction

ΔrH° (kcal/mol) T (K) Method Reference Comment
23.2 (+1.0,-0.) CIDArmentrout and Kickel, 1994gas phase; guided ion beam CID; M

(Iron ion (1+) • 2Methane) + Methane = (Iron ion (1+) • 3Methane)

By formula: (Fe+ • 2CH4) + CH4 = (Fe+ • 3CH4)

Enthalpy of reaction

ΔrH° (kcal/mol) T (K) Method Reference Comment
23.7 (+1.4,-0.) CIDArmentrout and Kickel, 1994gas phase; guided ion beam CID; M

(Iron ion (1+) • 3Methane) + Methane = (Iron ion (1+) • 4Methane)

By formula: (Fe+ • 3CH4) + CH4 = (Fe+ • 4CH4)

Enthalpy of reaction

ΔrH° (kcal/mol) T (K) Method Reference Comment
17.7 (+1.4,-0.) CIDArmentrout and Kickel, 1994gas phase; guided ion beam CID; M

Iron ion (1+) + Carbon monoxide = (Iron ion (1+) • Carbon monoxide)

By formula: Fe+ + CO = (Fe+ • CO)

Quantity Value Units Method Reference Comment
Δr30.8 ± 1.0kcal/molCIDTRodgers and Armentrout, 2000RCD
Δr32. ± 3.kcal/molMKERCarpenter, van Koppen, et al., 1995gas phase; determined from MKER and theory; M

Enthalpy of reaction

ΔrH° (kcal/mol) T (K) Method Reference Comment
31.3 (+1.9,-0.) CIDArmentrout and Kickel, 1994gas phase; guided ion beam CID; M

(Iron ion (1+) • Carbon monoxide) + Carbon monoxide = (Iron ion (1+) • 2Carbon monoxide)

By formula: (Fe+ • CO) + CO = (Fe+ • 2CO)

Quantity Value Units Method Reference Comment
Δr35.4 ± 1.2kcal/molCIDTRodgers and Armentrout, 2000RCD

Enthalpy of reaction

ΔrH° (kcal/mol) T (K) Method Reference Comment
36.1 (+3.4,-0.) CIDArmentrout and Kickel, 1994gas phase; guided ion beam CID; M

(Iron ion (1+) • 2Carbon monoxide) + Carbon monoxide = (Iron ion (1+) • 3Carbon monoxide)

By formula: (Fe+ • 2CO) + CO = (Fe+ • 3CO)

Quantity Value Units Method Reference Comment
Δr16.5 ± 1.4kcal/molCIDTRodgers and Armentrout, 2000RCD

Enthalpy of reaction

ΔrH° (kcal/mol) T (K) Method Reference Comment
15.8 (+1.2,-0.) CIDArmentrout and Kickel, 1994gas phase; guided ion beam CID; M

(Iron ion (1+) • 3Carbon monoxide) + Carbon monoxide = (Iron ion (1+) • 4Carbon monoxide)

By formula: (Fe+ • 3CO) + CO = (Fe+ • 4CO)

Quantity Value Units Method Reference Comment
Δr23.4 ± 1.4kcal/molCIDTRodgers and Armentrout, 2000RCD

Enthalpy of reaction

ΔrH° (kcal/mol) T (K) Method Reference Comment
24.6 (+1.7,-0.) CIDArmentrout and Kickel, 1994gas phase; guided ion beam CID; M

(Iron ion (1+) • 4Carbon monoxide) + Carbon monoxide = (Iron ion (1+) • 5Carbon monoxide)

By formula: (Fe+ • 4CO) + CO = (Fe+ • 5CO)

Quantity Value Units Method Reference Comment
Δr23.2 ± 1.0kcal/molCIDTRodgers and Armentrout, 2000RCD

Enthalpy of reaction

ΔrH° (kcal/mol) T (K) Method Reference Comment
26.8 (+1.0,-0.) CIDArmentrout and Kickel, 1994gas phase; guided ion beam CID; M

(Iron ion (1+) • 3Carbon monoxide • 2iron) + Carbon monoxide = (Iron ion (1+) • 4Carbon monoxide • 2iron)

By formula: (Fe+ • 3CO • 2Fe) + CO = (Fe+ • 4CO • 2Fe)

Quantity Value Units Method Reference Comment
Δr56.9kcal/molPDissTecklenberg, Bricker, et al., 1988gas phase; ΔrH<; M

Iron ion (1+) + Carbon dioxide = (Iron ion (1+) • Carbon dioxide)

By formula: Fe+ + CO2 = (Fe+ • CO2)

Quantity Value Units Method Reference Comment
Δr14.3 ± 1.0kcal/molCIDTRodgers and Armentrout, 2000RCD

Iron ion (1+) + Carbon monosulfide = (Iron ion (1+) • Carbon monosulfide)

By formula: Fe+ + CS = (Fe+ • CS)

Quantity Value Units Method Reference Comment
Δr49.5 ± 3.1kcal/molCIDTRodgers and Armentrout, 2000RCD
Δr55.2 ± 2.8kcal/molCIDTSchroeder, Kretzschmar, et al., 1999RCD

Iron ion (1+) + Carbon disulfide = (Iron ion (1+) • Carbon disulfide)

By formula: Fe+ + CS2 = (Fe+ • CS2)

Quantity Value Units Method Reference Comment
Δr39.7 ± 1.2kcal/molCIDTRodgers and Armentrout, 2000RCD

(Iron ion (1+) • Carbon disulfide) + Carbon disulfide = (Iron ion (1+) • 2Carbon disulfide)

By formula: (Fe+ • CS2) + CS2 = (Fe+ • 2CS2)

Quantity Value Units Method Reference Comment
Δr44.9 ± 1.4kcal/molCIDTRodgers and Armentrout, 2000RCD

Iron ion (1+) + Acetylene = (Iron ion (1+) • Acetylene)

By formula: Fe+ + C2H2 = (Fe+ • C2H2)

Quantity Value Units Method Reference Comment
Δr36.1 ± 1.9kcal/molIRMPDSurya, Ranatunga, et al., 1997RCD

Iron ion (1+) + Ethylene = (Iron ion (1+) • Ethylene)

By formula: Fe+ + C2H4 = (Fe+ • C2H4)

Quantity Value Units Method Reference Comment
Δr34.7 ± 2.6kcal/molCIDTSievers, Jarvis, et al., 1998RCD

Enthalpy of reaction

ΔrH° (kcal/mol) T (K) Method Reference Comment
34.6 (+1.4,-0.) CIDArmentrout and Kickel, 1994gas phase; guided ion beam CID; M

(Iron ion (1+) • Ethylene) + Ethylene = (Iron ion (1+) • 2Ethylene)

By formula: (Fe+ • C2H4) + C2H4 = (Fe+ • 2C2H4)

Quantity Value Units Method Reference Comment
Δr36.1 ± 3.6kcal/molCIDTSievers, Jarvis, et al., 1998RCD

Iron ion (1+) + C2H6Si = (Iron ion (1+) • C2H6Si)

By formula: Fe+ + C2H6Si = (Fe+ • C2H6Si)

Quantity Value Units Method Reference Comment
Δr68.5 ± 8.5kcal/molICRJacobson and Bakhtiar, 1993gas phase; M

Iron ion (1+) + C2H6Si = (Iron ion (1+) • C2H6Si)

By formula: Fe+ + C2H6Si = (Fe+ • C2H6Si)

Quantity Value Units Method Reference Comment
Δr63. ± 8.kcal/molICRJacobson and Bakhtiar, 1993gas phase; M

Iron ion (1+) + Ethane = (Iron ion (1+) • Ethane)

By formula: Fe+ + C2H6 = (Fe+ • C2H6)

Quantity Value Units Method Reference Comment
Δr18. ± 3.kcal/molMKERCarpenter, van Koppen, et al., 1995gas phase; M

Enthalpy of reaction

ΔrH° (kcal/mol) T (K) Method Reference Comment
15.3 (+1.4,-0.) CIDArmentrout and Kickel, 1994gas phase; guided ion beam CID; M

Iron ion (1+) + Propene = (Iron ion (1+) • Propene)

By formula: Fe+ + C3H6 = (Fe+ • C3H6)

Enthalpy of reaction

ΔrH° (kcal/mol) T (K) Method Reference Comment
34.7 (+1.7,-0.) CIDArmentrout and Kickel, 1994gas phase; guided ion beam CID; M

Iron ion (1+) + 2-Silaisobutene = (Iron ion (1+) • 2-Silaisobutene)

By formula: Fe+ + C3H8Si = (Fe+ • C3H8Si)

Quantity Value Units Method Reference Comment
Δr64. ± 9.kcal/molICRJacobson and Bakhtiar, 1993gas phase; M

Iron ion (1+) + Propane = (Iron ion (1+) • Propane)

By formula: Fe+ + C3H8 = (Fe+ • C3H8)

Enthalpy of reaction

ΔrH° (kcal/mol) T (K) Method Reference Comment
17.9 (+1.0,-0.) CIDArmentrout and Kickel, 1994gas phase; guided ion beam CID; M

Iron ion (1+) + 1,3-Diazine = (Iron ion (1+) • 1,3-Diazine)

By formula: Fe+ + C4H4N2 = (Fe+ • C4H4N2)

Quantity Value Units Method Reference Comment
Δr47.5 ± 1.9kcal/molCIDTAmunugama and Rodgers, 2001RCD

Iron ion (1+) + Pyrrole = (Iron ion (1+) • Pyrrole)

By formula: Fe+ + C4H5N = (Fe+ • C4H5N)

Quantity Value Units Method Reference Comment
Δr54.0kcal/molRAKGapeev and Yang, 2000RCD

(Iron ion (1+) • Pyrrole) + Pyrrole = (Iron ion (1+) • 2Pyrrole)

By formula: (Fe+ • C4H5N) + C4H5N = (Fe+ • 2C4H5N)

Quantity Value Units Method Reference Comment
Δr41.6kcal/molRAKGapeev and Yang, 2000RCD

Iron ion (1+) + Pyridine = (Iron ion (1+) • Pyridine)

By formula: Fe+ + C5H5N = (Fe+ • C5H5N)

Quantity Value Units Method Reference Comment
Δr53.4 ± 2.2kcal/molCIDTRodgers, Stanley, et al., 2000RCD

Iron ion (1+) + Adenine = (Iron ion (1+) • Adenine)

By formula: Fe+ + C5H5N5 = (Fe+ • C5H5N5)

Quantity Value Units Method Reference Comment
Δr62.0 ± 2.1kcal/molCIDTRodgers and Armentrout, 2002RCD

Iron ion (1+) + Benzene = (Iron ion (1+) • Benzene)

By formula: Fe+ + C6H6 = (Fe+ • C6H6)

Quantity Value Units Method Reference Comment
Δr47.1kcal/molRAKGapeev and Dunbar, 2002RCD
Δr49.5 ± 2.9kcal/molCIDTMeyer, Khan, et al., 1995RCD

Enthalpy of reaction

ΔrH° (kcal/mol) T (K) Method Reference Comment
49.6 (+2.3,-0.) CIDMeyer, Khan, et al., 1995gas phase; guided ion beam CID; M

(Iron ion (1+) • Benzene) + Benzene = (Iron ion (1+) • 2Benzene)

By formula: (Fe+ • C6H6) + C6H6 = (Fe+ • 2C6H6)

Quantity Value Units Method Reference Comment
Δr44.7 ± 3.8kcal/molCIDTMeyer, Khan, et al., 1995RCD

Enthalpy of reaction

ΔrH° (kcal/mol) T (K) Method Reference Comment
44.7 (+3.9,-0.) CIDMeyer, Khan, et al., 1995gas phase; guided ion beam CID; M

Iron ion (1+) + iron = (Iron ion (1+) • iron)

By formula: Fe+ + Fe = (Fe+ • Fe)

Quantity Value Units Method Reference Comment
Δr62.kcal/molCIDLoh, Lian, et al., 1988gas phase; M
Δr62.4kcal/molPDissTecklenberg, Bricker, et al., 1988gas phase; ΔrH>; M

Enthalpy of reaction

ΔrH° (kcal/mol) T (K) Method Reference Comment
64.1 CIDArmentrout and Kickel, 1994gas phase; guided ion beam CID; M

(Iron ion (1+) • iron) + Carbon monoxide = (Iron ion (1+) • Carbon monoxide • iron)

By formula: (Fe+ • Fe) + CO = (Fe+ • CO • Fe)

Quantity Value Units Method Reference Comment
Δr58.6kcal/molPDissTecklenberg, Bricker, et al., 1988gas phase; ΔrH<; M

(Iron ion (1+) • iron) + iron = (Iron ion (1+) • 2iron)

By formula: (Fe+ • Fe) + Fe = (Fe+ • 2Fe)

Quantity Value Units Method Reference Comment
Δr55.6kcal/molPDissTecklenberg, Bricker, et al., 1988gas phase; ΔrH<; M

Enthalpy of reaction

ΔrH° (kcal/mol) T (K) Method Reference Comment
40.4 CIDArmentrout and Kickel, 1994gas phase; guided ion beam CID; M

(Iron ion (1+) • 2iron) + iron = (Iron ion (1+) • 3iron)

By formula: (Fe+ • 2Fe) + Fe = (Fe+ • 3Fe)

Quantity Value Units Method Reference Comment
Δr41.5kcal/molCIDLoh, Lian, et al., 1988gas phase; M

Enthalpy of reaction

ΔrH° (kcal/mol) T (K) Method Reference Comment
51.6 CIDArmentrout and Kickel, 1994gas phase; guided ion beam CID; M

(Iron ion (1+) • 3iron) + iron = (Iron ion (1+) • 4iron)

By formula: (Fe+ • 3Fe) + Fe = (Fe+ • 4Fe)

Enthalpy of reaction

ΔrH° (kcal/mol) T (K) Method Reference Comment
62.1 CIDArmentrout and Kickel, 1994gas phase; guided ion beam CID; M

(Iron ion (1+) • 4iron) + iron = (Iron ion (1+) • 5iron)

By formula: (Fe+ • 4Fe) + Fe = (Fe+ • 5Fe)

Enthalpy of reaction

ΔrH° (kcal/mol) T (K) Method Reference Comment
75.3 CIDArmentrout and Kickel, 1994gas phase; guided ion beam CID; M

(Iron ion (1+) • 5iron) + iron = (Iron ion (1+) • 6iron)

By formula: (Fe+ • 5Fe) + Fe = (Fe+ • 6Fe)

Enthalpy of reaction

ΔrH° (kcal/mol) T (K) Method Reference Comment
76.5 CIDArmentrout and Kickel, 1994gas phase; guided ion beam CID; M

(Iron ion (1+) • 6iron) + iron = (Iron ion (1+) • 7iron)

By formula: (Fe+ • 6Fe) + Fe = (Fe+ • 7Fe)

Enthalpy of reaction

ΔrH° (kcal/mol) T (K) Method Reference Comment
60.2 CIDArmentrout and Kickel, 1994gas phase; guided ion beam CID; M

(Iron ion (1+) • 7iron) + iron = (Iron ion (1+) • 8iron)

By formula: (Fe+ • 7Fe) + Fe = (Fe+ • 8Fe)

Enthalpy of reaction

ΔrH° (kcal/mol) T (K) Method Reference Comment
67.2 CIDArmentrout and Kickel, 1994gas phase; guided ion beam CID; M

(Iron ion (1+) • 8iron) + iron = (Iron ion (1+) • 9iron)

By formula: (Fe+ • 8Fe) + Fe = (Fe+ • 9Fe)

Enthalpy of reaction

ΔrH° (kcal/mol) T (K) Method Reference Comment
67.9 CIDArmentrout and Kickel, 1994gas phase; guided ion beam CID; M

(Iron ion (1+) • 9iron) + iron = (Iron ion (1+) • 10iron)

By formula: (Fe+ • 9Fe) + Fe = (Fe+ • 10Fe)

Enthalpy of reaction

ΔrH° (kcal/mol) T (K) Method Reference Comment
73.6 CIDArmentrout and Kickel, 1994gas phase; guided ion beam CID; M

(Iron ion (1+) • 10iron) + iron = (Iron ion (1+) • 11iron)

By formula: (Fe+ • 10Fe) + Fe = (Fe+ • 11Fe)

Enthalpy of reaction

ΔrH° (kcal/mol) T (K) Method Reference Comment
79.8 CIDArmentrout and Kickel, 1994gas phase; guided ion beam CID; M

(Iron ion (1+) • 11iron) + iron = (Iron ion (1+) • 12iron)

By formula: (Fe+ • 11Fe) + Fe = (Fe+ • 12Fe)

Enthalpy of reaction

ΔrH° (kcal/mol) T (K) Method Reference Comment
97.5 CIDArmentrout and Kickel, 1994gas phase; guided ion beam CID; M

(Iron ion (1+) • 12iron) + iron = (Iron ion (1+) • 13iron)

By formula: (Fe+ • 12Fe) + Fe = (Fe+ • 13Fe)

Enthalpy of reaction

ΔrH° (kcal/mol) T (K) Method Reference Comment
67.2 CIDArmentrout and Kickel, 1994gas phase; guided ion beam CID; M

(Iron ion (1+) • 13iron) + iron = (Iron ion (1+) • 14iron)

By formula: (Fe+ • 13Fe) + Fe = (Fe+ • 14Fe)

Enthalpy of reaction

ΔrH° (kcal/mol) T (K) Method Reference Comment
90.1 CIDArmentrout and Kickel, 1994gas phase; guided ion beam CID; M

(Iron ion (1+) • 14iron) + iron = (Iron ion (1+) • 15iron)

By formula: (Fe+ • 14Fe) + Fe = (Fe+ • 15Fe)

Enthalpy of reaction

ΔrH° (kcal/mol) T (K) Method Reference Comment
76.2 CIDArmentrout and Kickel, 1994gas phase; guided ion beam CID; M

(Iron ion (1+) • 15iron) + iron = (Iron ion (1+) • 16iron)

By formula: (Fe+ • 15Fe) + Fe = (Fe+ • 16Fe)

Enthalpy of reaction

ΔrH° (kcal/mol) T (K) Method Reference Comment
77.2 CIDArmentrout and Kickel, 1994gas phase; guided ion beam CID; M

(Iron ion (1+) • 16iron) + iron = (Iron ion (1+) • 17iron)

By formula: (Fe+ • 16Fe) + Fe = (Fe+ • 17Fe)

Enthalpy of reaction

ΔrH° (kcal/mol) T (K) Method Reference Comment
74.3 CIDArmentrout and Kickel, 1994gas phase; guided ion beam CID; M

(Iron ion (1+) • 17iron) + iron = (Iron ion (1+) • 18iron)

By formula: (Fe+ • 17Fe) + Fe = (Fe+ • 18Fe)

Enthalpy of reaction

ΔrH° (kcal/mol) T (K) Method Reference Comment
89.1 CIDArmentrout and Kickel, 1994gas phase; guided ion beam CID; M

Iron ion (1+) + Water = (Iron ion (1+) • Water)

By formula: Fe+ + H2O = (Fe+ • H2O)

Quantity Value Units Method Reference Comment
Δr29. ± 3.kcal/molCIDMagnera, David, et al., 1989gas phase; M
Δr32.8kcal/molCIDMarinelli and Squires, 1989gas phase; M

Enthalpy of reaction

ΔrH° (kcal/mol) T (K) Method Reference Comment
30.6 (+1.2,-0.) CIDArmentrout and Kickel, 1994gas phase; guided ion beam CID; M

(Iron ion (1+) • Water) + Water = (Iron ion (1+) • 2Water)

By formula: (Fe+ • H2O) + H2O = (Fe+ • 2H2O)

Quantity Value Units Method Reference Comment
Δr40.8kcal/molCIDMarinelli and Squires, 1989gas phase; M

Enthalpy of reaction

ΔrH° (kcal/mol) T (K) Method Reference Comment
39.2 (+1.0,-0.) CIDArmentrout and Kickel, 1994gas phase; guided ion beam CID; M

(Iron ion (1+) • 2Water) + Water = (Iron ion (1+) • 3Water)

By formula: (Fe+ • 2H2O) + H2O = (Fe+ • 3H2O)

Enthalpy of reaction

ΔrH° (kcal/mol) T (K) Method Reference Comment
18.2 (+1.0,-0.) CIDArmentrout and Kickel, 1994gas phase; guided ion beam CID; M

(Iron ion (1+) • 3Water) + Water = (Iron ion (1+) • 4Water)

By formula: (Fe+ • 3H2O) + H2O = (Fe+ • 4H2O)

Enthalpy of reaction

ΔrH° (kcal/mol) T (K) Method Reference Comment
19.6 (+1.7,-0.) CIDArmentrout and Kickel, 1994gas phase; guided ion beam CID; M

Iron ion (1+) + Silylene = (Iron ion (1+) • Silylene)

By formula: Fe+ + H2Si = (Fe+ • H2Si)

Quantity Value Units Method Reference Comment
Δr67. ± 12.kcal/molICRJacobson and Bakhtiar, 1993gas phase; M

Iron ion (1+) + Hydrogen = (Iron ion (1+) • Hydrogen)

By formula: Fe+ + H2 = (Fe+ • H2)

Quantity Value Units Method Reference Comment
Δr12.5 ± 0.2kcal/molSIDTBushnell, Kemper, et al., 1995gas phase; ΔrH(0K) = 10.8 kcal/mol; M
Quantity Value Units Method Reference Comment
Δr21.5cal/mol*KSIDTBushnell, Kemper, et al., 1995gas phase; ΔrH(0K) = 10.8 kcal/mol; M

(Iron ion (1+) • Hydrogen) + Hydrogen = (Iron ion (1+) • 2Hydrogen)

By formula: (Fe+ • H2) + H2 = (Fe+ • 2H2)

Quantity Value Units Method Reference Comment
Δr17.0 ± 0.2kcal/molSIDTBushnell, Kemper, et al., 1995gas phase; ΔrH(0K) = 15.7 kcal/mol; M
Quantity Value Units Method Reference Comment
Δr25.2cal/mol*KSIDTBushnell, Kemper, et al., 1995gas phase; ΔrH(0K) = 15.7 kcal/mol; M

(Iron ion (1+) • 2Hydrogen) + Hydrogen = (Iron ion (1+) • 3Hydrogen)

By formula: (Fe+ • 2H2) + H2 = (Fe+ • 3H2)

Quantity Value Units Method Reference Comment
Δr8.4 ± 0.1kcal/molSIDTBushnell, Kemper, et al., 1995gas phase; ΔrH(0K) = 7.5 kcal/mol; M
Quantity Value Units Method Reference Comment
Δr19.1cal/mol*KSIDTBushnell, Kemper, et al., 1995gas phase; ΔrH(0K) = 7.5 kcal/mol; M

(Iron ion (1+) • 3Hydrogen) + Hydrogen = (Iron ion (1+) • 4Hydrogen)

By formula: (Fe+ • 3H2) + H2 = (Fe+ • 4H2)

Quantity Value Units Method Reference Comment
Δr9.7 ± 0.1kcal/molSIDTBushnell, Kemper, et al., 1995gas phase; ΔrH(0K) = 8.6 kcal/mol; M
Quantity Value Units Method Reference Comment
Δr24.9cal/mol*KSIDTBushnell, Kemper, et al., 1995gas phase; ΔrH(0K) = 8.6 kcal/mol; M

(Iron ion (1+) • 4Hydrogen) + Hydrogen = (Iron ion (1+) • 5Hydrogen)

By formula: (Fe+ • 4H2) + H2 = (Fe+ • 5H2)

Quantity Value Units Method Reference Comment
Δr2.6 ± 0.1kcal/molSIDTBushnell, Kemper, et al., 1995gas phase; ΔrH(0K) = 2.2 kcal/mol; M
Quantity Value Units Method Reference Comment
Δr17.9cal/mol*KSIDTBushnell, Kemper, et al., 1995gas phase; ΔrH(0K) = 2.2 kcal/mol; M

(Iron ion (1+) • 5Hydrogen) + Hydrogen = (Iron ion (1+) • 6Hydrogen)

By formula: (Fe+ • 5H2) + H2 = (Fe+ • 6H2)

Quantity Value Units Method Reference Comment
Δr2.7 ± 0.1kcal/molSIDTBushnell, Kemper, et al., 1995gas phase; ΔrH(0K) = 2.3 kcal/mol; M
Quantity Value Units Method Reference Comment
Δr18.1cal/mol*KSIDTBushnell, Kemper, et al., 1995gas phase; ΔrH(0K) = 2.3 kcal/mol; M

Iron ion (1+) + Ammonia = (Iron ion (1+) • Ammonia)

By formula: Fe+ + H3N = (Fe+ • H3N)

Quantity Value Units Method Reference Comment
Δr43.7 ± 2.9kcal/molCIDTWalter and Armentrout, 1998RCD
Δr38.5kcal/molCIDMarinelli and Squires, 1989gas phase; M

(Iron ion (1+) • Ammonia) + Ammonia = (Iron ion (1+) • 2Ammonia)

By formula: (Fe+ • H3N) + H3N = (Fe+ • 2H3N)

Quantity Value Units Method Reference Comment
Δr53.8 ± 2.9kcal/molCIDTWalter and Armentrout, 1998RCD
Δr48.7kcal/molCIDMarinelli and Squires, 1989gas phase; M

(Iron ion (1+) • 2Ammonia) + Ammonia = (Iron ion (1+) • 3Ammonia)

By formula: (Fe+ • 2H3N) + H3N = (Fe+ • 3H3N)

Quantity Value Units Method Reference Comment
Δr16.3 ± 3.1kcal/molCIDTWalter and Armentrout, 1998RCD

(Iron ion (1+) • 3Ammonia) + Ammonia = (Iron ion (1+) • 4Ammonia)

By formula: (Fe+ • 3H3N) + H3N = (Fe+ • 4H3N)

Quantity Value Units Method Reference Comment
Δr10.0 ± 1.7kcal/molCIDTWalter and Armentrout, 1998RCD

Iron ion (1+) + Krypton = (Iron ion (1+) • Krypton)

By formula: Fe+ + Kr = (Fe+ • Kr)

Quantity Value Units Method Reference Comment
Δr7.2 ± 1.7kcal/molCIDTRodgers and Armentrout, 2000RCD

Iron ion (1+) + Nitrogen = (Iron ion (1+) • Nitrogen)

By formula: Fe+ + N2 = (Fe+ • N2)

Quantity Value Units Method Reference Comment
Δr12.9 ± 1.4kcal/molCIDTRodgers and Armentrout, 2000RCD

(Iron ion (1+) • Nitrogen) + Nitrogen = (Iron ion (1+) • 2Nitrogen)

By formula: (Fe+ • N2) + N2 = (Fe+ • 2N2)

Quantity Value Units Method Reference Comment
Δr19.8 ± 2.2kcal/molCIDTRodgers and Armentrout, 2000RCD

(Iron ion (1+) • 2Nitrogen) + Nitrogen = (Iron ion (1+) • 3Nitrogen)

By formula: (Fe+ • 2N2) + N2 = (Fe+ • 3N2)

Quantity Value Units Method Reference Comment
Δr10.8 ± 0.7kcal/molCIDTRodgers and Armentrout, 2000RCD

(Iron ion (1+) • 3Nitrogen) + Nitrogen = (Iron ion (1+) • 4Nitrogen)

By formula: (Fe+ • 3N2) + N2 = (Fe+ • 4N2)

Quantity Value Units Method Reference Comment
Δr12.9 ± 1.0kcal/molCIDTRodgers and Armentrout, 2000RCD

(Iron ion (1+) • 4Nitrogen) + Nitrogen = (Iron ion (1+) • 5Nitrogen)

By formula: (Fe+ • 4N2) + N2 = (Fe+ • 5N2)

Quantity Value Units Method Reference Comment
Δr14.8 ± 1.0kcal/molCIDTRodgers and Armentrout, 2000RCD

Iron ion (1+) + Xenon = (Iron ion (1+) • Xenon)

By formula: Fe+ + Xe = (Fe+ • Xe)

Quantity Value Units Method Reference Comment
Δr10.0 ± 1.4kcal/molCIDTRodgers and Armentrout, 2000RCD

Gas phase thermochemistry data

Quantity Value Units Method Reference Comment
gas,1 bar43.466cal/mol*KReviewChase, 1998Data last reviewed in June, 1984

References

Rodgers and Armentrout, 2000
Rodgers, M.T.; Armentrout, P.B., Noncovalent Metal-Ligand Bond Energies as Studied by Threshold Collision-Induced Dissociation, Mass Spectrom. Rev., 2000, 19, 4, 215, https://doi.org/10.1002/1098-2787(200007)19:4<215::AID-MAS2>3.0.CO;2-X . [all data]

Fisher, Schultz, et al., 1989
Fisher, E.R.; Schultz, r.H.; Armentrout, P.B., Guided Ion Beam Studies of the State - Specific Reactions of Fe+(6D,4F) with CH3X (X = Cl, Br, I), J. Phys. Chem., 1989, 93, 21, 7382, https://doi.org/10.1021/j100358a027 . [all data]

Schultz, Elkind, et al., 1988
Schultz, R.H.; Elkind, J.L.; Armentrout, P.B., Electronic Effects in C-H and C-C Bond Activation: State-Specific Reactions of Fe+(6D,4F) with Methane, Ethane and Propane, J. Am. Chem. Soc., 1988, 110, 2, 411, https://doi.org/10.1021/ja00210a017 . [all data]

Jacobson and Bakhtiar, 1993
Jacobson, D.B.; Bakhtiar, R., Generation, Characterization and Properties of Iron-Silylene and Iron-Sylene Cationic Complexes in the Gas Phase, J. Am. Chem. Soc., 1993, 115, 23, 10830, https://doi.org/10.1021/ja00076a046 . [all data]

Armentrout and Kickel, 1994
Armentrout, P.B.; Kickel, B.L., Gas Phase Thermochemistry of Transition Metal Ligand Systems: Reassessment of Values and Periodic Trends, in Organometallic Ion Chemistry, B. S. Freiser, ed, 1994. [all data]

Carpenter, van Koppen, et al., 1995
Carpenter, C.J.; van Koppen, P.A.M.; Bowers, M.T., Details of Potential Energy Surfaces Involving C-C Bond Activation: Reactions of Fe+, Co+ and Ni+ with Acetone, J. Am. Chem. Soc., 1995, 117, 44, 10976, https://doi.org/10.1021/ja00149a021 . [all data]

Tecklenberg, Bricker, et al., 1988
Tecklenberg, R.E.; Bricker, D.L.; Russel, D.H., Laser - Ion Beam Photodissociation Studies of Ionic Cluster Fragments of Iron Carbonyls: Fe(x)(CO)y+ (x = 1 - 3; y = 0 - 6), Organometallics, 1988, 7, 12, 2506, https://doi.org/10.1021/om00102a013 . [all data]

Schroeder, Kretzschmar, et al., 1999
Schroeder, D.; Kretzschmar, I.; Schwarz; Rue, C.; Armentrout, P.B., On the Structural Dichotomy of Cationic, Anionic, and Neutral FeS2, Inorg. Chem., 1999, 38, 15, 3474, https://doi.org/10.1021/ic990241b . [all data]

Surya, Ranatunga, et al., 1997
Surya, P.I.; Ranatunga, D.R.A.; Freiser, B.S., Infrared Multiphoton Dissociation of MC4H6+ [M=Fe, Co or Ni: C4H6=1,3-butadiene or (C2H2)(C2H4), J. Am. Chem. Soc., 1997, 119, 14, 3351, https://doi.org/10.1021/ja963200c . [all data]

Sievers, Jarvis, et al., 1998
Sievers, M.R.; Jarvis, L.M.; Armentrout, P.B., Transition Metal Ethene Bonds: Thermochemistry of M+(C2H4)n (M=Ti-Cu, n=1 and 2) Complexes, J. Am. Chem. Soc., 1998, 120, 8, 1891, https://doi.org/10.1021/ja973834z . [all data]

Amunugama and Rodgers, 2001
Amunugama, R.; Rodgers, M.T., Periodic Trends in the Binding of Metal Ions to Pyrimidine Studied by Threshold Collision-Induced Dissociation and Density Functional Theory, J. Phys. Chem. A, 2001, 105, 43, 9883, https://doi.org/10.1021/jp010663i . [all data]

Gapeev and Yang, 2000
Gapeev, A.; Yang, C.-N., Binding Energies of Gas-Phase Ions with Pyrrole. Experimental and Quantum Chemical Results, J. Phys. Chem. A, 2000, 104, 14, 3246, https://doi.org/10.1021/jp992627d . [all data]

Rodgers, Stanley, et al., 2000
Rodgers, M.T.; Stanley, J.R.; Amunugama, R., Periodic Trends in the Binding of Metal Ions to Pyridine Studied by Threshold Collision-Induced Dissociation and Density Functional Theory, J. Am. Chem. Soc., 2000, 122, 44, 10969, https://doi.org/10.1021/ja0027923 . [all data]

Rodgers and Armentrout, 2002
Rodgers, M.T.; Armentrout, P.B., Influence of d orbital occupation on the binding of metal ions to adenine, J. Am. Chem. Soc., 2002, 124, 11, 2678, https://doi.org/10.1021/ja011278+ . [all data]

Gapeev and Dunbar, 2002
Gapeev, A.; Dunbar, R.C., Reactivity and Binding Energies of Transition Metal Halide Ions with Benzene, J. Am. Soc. Mass Spectrom., 2002, 13, 5, 477, https://doi.org/10.1016/S1044-0305(02)00373-2 . [all data]

Meyer, Khan, et al., 1995
Meyer, F.; Khan, F.A.; Armentrout, P.B., Thermochemistry of Transition Metal Benzene complexes: Binding energies of M(C6H6)x+ (x = 1,2) for M = Ti to Cu, J. Am. Chem. Soc., 1995, 117, 38, 9740, https://doi.org/10.1021/ja00143a018 . [all data]

Loh, Lian, et al., 1988
Loh, S.K.; Lian, L.; Hales, D.A.; Armentrout, P.B., Collision - Induced Dissociation Processes of Nb4+ and Fe4+: Fission vs Evaporation, J. Chem. Phys., 1988, 89, 1, 610, https://doi.org/10.1063/1.455455 . [all data]

Magnera, David, et al., 1989
Magnera, T.F.; David, D.E.; Michl, J., Gas -Phase Water and Hydroxyl Binding Energies for Monopoisitive First - Row Transition - Metal Ions, J. Am. Chem. Soc., 1989, 111, 11, 4101, https://doi.org/10.1021/ja00193a051 . [all data]

Marinelli and Squires, 1989
Marinelli, P.J.; Squires, R.R., Sequential Solvation of Atomic Transition Metal Ions: The Second Solvent Molecule Can Bind More Strongly than the First, J. Am. Chem. Soc., 1989, 111, 11, 4101, https://doi.org/10.1021/ja00193a052 . [all data]

Bushnell, Kemper, et al., 1995
Bushnell, J.E.; Kemper, P.R.; Bowers, M.T., Factors Affecting sigma Bond Activation in Simple Systems; Measurement of Experimental Binding energies of Fe+(H2)1-6 Clusters, J. Phys. Chem., 1995, 99, 42, 15602, https://doi.org/10.1021/j100042a040 . [all data]

Walter and Armentrout, 1998
Walter, D.; Armentrout, P.B., Periodic Trends in Chemical Reactivity: Reactions of Sc+, Y+, La+, and Lu+ with H2, D2 and HD, J. Am. Chem. Soc., 1998, 120, 13, 3176, https://doi.org/10.1021/ja973202c . [all data]