Methyl N,N-,α,α-tetramethylglycinate

Condensed phase thermochemistry data

Data compiled as indicated in comments:
ALS - Hussein Y. Afeefy, Joel F. Liebman, and Stephen E. Stein
DH - Eugene S. Domalski and Elizabeth D. Hearing

Quantity Value Units Method Reference Comment
Δfliquid-119.88 ± 0.18kcal/molCcbVerevkin, Beckhaus, et al., 1992ALS
Quantity Value Units Method Reference Comment
Δcliquid-1050.84 ± 0.16kcal/molCcbVerevkin, Beckhaus, et al., 1992ALS

Constant pressure heat capacity of liquid

Cp,liquid (cal/mol*K) Temperature (K) Reference Comment
75.50298.15Verevkin, Beckhaus, et al., 1992DH

References

Verevkin, Beckhaus, et al., 1992
Verevkin, S.P.; Beckhaus, H.-D.; Ruchardt, C., Geminale substituenteneffekte Teil 5α. Standardbildungsenthalpien von alkylsubstituierten Malonsaure- und α-aminocarbonsaureestern, Thermochim. Acta, 1992, 197, 27-39. [all data]