C16

Gas phase ion energetics data

Data compiled by: John E. Bartmess

Electron affinity determinations

EA (eV) Method Reference Comment
2.4500 ± 0.0043LPESAchiba, Kohno, et al., 2005EA=Vertical Detachment Energy. Ring Structure likely.
2.50 ± 0.10LPESYang, Taylor, et al., 1989EA given is Vertical Detachment Energy. probably ring structure
4.700021LPESKohno, Suzuki, et al., 1998Vertical Detachment Energy, linear isomer

References

Achiba, Kohno, et al., 2005
Achiba, Y.; Kohno, M.; Ohara, M.; Suzuki, S.; Shiromaru, H., Electron detachment spectroscopic study on carbon and silicon cluster anions, J. Electron Spectros. Rel. Phenom., 2005, 142, 3, 231-240, https://doi.org/10.1016/j.elspec.2004.09.016 . [all data]

Yang, Taylor, et al., 1989
Yang, S.; Taylor, K.J.; Craycraft, M.J.; Conceicao, J.; Pettiette, C.L.; Cherhnovsky, O.; Smalley, R.E., UPS of 2-30 Atom Carbon Clusters: Chains and Rings, Chem. Phys. Lett., 1989, 144, 5-6, 431, https://doi.org/10.1016/0009-2614(88)87291-9 . [all data]

Kohno, Suzuki, et al., 1998
Kohno, M.; Suzuki, S.; Shiromaru, H.; Moriwaki, T.; Achiba, Y., Ultraviolet Photoelectron Spectroscopy on the Linear Conformer of Negatively Charged Carbon Clusters Cn- (1- =n=16), Chem. Phys. Lett., 1998, 282, 3-4, 330, https://doi.org/10.1016/S0009-2614(97)01273-6 . [all data]