Butanoic acid, 3-methyl-, 2-phenylethyl ester

Van Den Dool and Kratz RI, polar column, temperature ramp

Data compiled by: NIST Mass Spectrometry Data Center, William E. Wallace, director

Column type CapillaryCapillaryCapillary
Active phase RTX-WaxRTX-WaxBP-20
Column length (m) 60.60.50.
Carrier gas HeHeHe
Substrate
Column diameter (mm) 0.220.220.22
Phase thickness (μm) 0.250.250.25
Tstart (C) 60.60.60.
Tend (C) 230.230.220.
Heat rate (K/min) 2.2.2.
Initial hold (min)
Final hold (min) 35.35.20.
I 1954.1964.1980.
ReferencePaolini, Muselli, et al., 2007Paolini, Costa, et al., 2005Rezzi, Bighelli, et al., 2001
Comment MSDC-RI MSDC-RI MSDC-RI

References

Paolini, Muselli, et al., 2007
Paolini, J.; Muselli, A.; Bernardini, A.-F.; Bighelli, A.; Casanova, J.; Costa, J., Thymol derivatives from essential oil of Doronicum corsicum L., Flavour Fragr. J., 2007, 22, 6, 479-487, https://doi.org/10.1002/ffj.1824 . [all data]

Paolini, Costa, et al., 2005
Paolini, J.; Costa, J.; Bernardini, A., Analysis of the essential oil from aerial parts of Eupatorium cannabinum subsp. corsicum (L.) by gas chromatography with electron impact and chemical ionization mass spectrometry, J. Chromatogr. A, 2005, 1076, 1-2, 170-178, https://doi.org/10.1016/j.chroma.2005.03.131 . [all data]

Rezzi, Bighelli, et al., 2001
Rezzi, S.; Bighelli, A.; Mouillot, D.; Casanova, J., Composition and chemical variability of the needle essential oil of Pinus nigra subsp. laricio from corsica, Flavour Fragr. J., 2001, 16, 5, 379-383, https://doi.org/10.1002/ffj.1018 . [all data]