Bis(acetylacetonato)cobalt

Gas phase ion energetics data

Data compiled as indicated in comments:
LBLHLM - Sharon G. Lias, John E. Bartmess, Joel F. Liebman, John L. Holmes, Rhoda D. Levin, and W. Gary Mallard
LLK - Sharon G. Lias, Rhoda D. Levin, and Sherif A. Kafafi
RDSH - Henry M. Rosenstock, Keith Draxl, Bruce W. Steiner, and John T. Herron

Ionization energy determinations

IE (eV) Method Reference Comment
7.6PEKitagawa, Morishima, et al., 1983LBLHLM
8.54 ± 0.05EIReichert and Westmore, 1969RDSH
7.93PEKitagawa, Morishima, et al., 1983Vertical value; LBLHLM
8.50PECauletti, Furlani, et al., 1980Vertical value; LLK

Appearance energy determinations

Ion AE (eV) Other Products MethodReferenceComment
C5H7O2Co+13.9 ± 0.2?EIReichert and Westmore, 1969RDSH
C9H11O4Co+11.5 ± 0.1?EIReichert and Westmore, 1969RDSH

References

Kitagawa, Morishima, et al., 1983
Kitagawa, S.; Morishima, I.; Yoshikawa, K., UV photoelectron spectra of some transition metal(II)aAcetylacetonates, Polyhedron, 1983, 2, 43. [all data]

Reichert and Westmore, 1969
Reichert, C.; Westmore, J.B., Mass spectral studies of metal chelates. IV.Mass spectra, appearance potentials, and coordinate bond energies of bis(acetylacetonate)metal(II) complexes of the first transition series, Inorg. Chem., 1969, 8, 1012. [all data]

Cauletti, Furlani, et al., 1980
Cauletti, C.; Furlani, C.; Storto, G., Coordinative bond d-shell ionisations in the UV photoelectron spectra of bis({beta}-diketonato) cobalt (II) copper (II) complexes, their thio analogues, J. Electron Spectrosc. Relat. Phenom., 1980, 18, 329. [all data]